{"text_format":"3","workbook":"xlsx","n_sheets":4,"sheets":["SKINS","Print","SAMPLE SHOTGUN","SAMPLE SPLIT TEE"],"not_rendered":{"images":1,"macros":1,"defined_names":6,"comments":1},"read":"whole","date_system":"1900"}

{"sheet":"SKINS","index":0,"n_rows":157,"n_cols":51,"rows_kept":157,"merged":[[0,0,0,1],[0,5,0,6],[0,7,0,8],[0,11,1,20],[0,48,2,48],[0,50,4,50],[1,0,1,1],[1,5,1,6],[1,7,1,8],[2,0,2,1],[2,5,3,6],[3,0,3,1],[140,6,140,24],[141,6,141,24]]}
["# \"IN\" Skins",null,{"$f":"COUNTIF(B6:B115,\"Y\")","v":0},"Skins $ Pot",{"$f":"IF(C2<C1,C2*C3+$H$2,C1*C3+$H$2)","v":{"v":2,"d":"$2"}},{"$f":"VLOOKUP($AT$4,$G$144:$AA$155,20,FALSE)","v":"Chas Muni"},null,"Carry Over",null,"PAID\nSKINS","POSTS","INTERCLUB SKINS",{"$nulls":9},"FWD SKINS","REG SKINS","FWD TOTAL","REG TOTAL","TOTAL PLYRS",{"$nulls":22},"   CAUTION:\n   SPLIT TEE \n   BUTTONS \nCROWFIELD \n          ONLY\n       ====>>",null,"Only use CLEAR macros after you've saved backup of workbook"]
["#  Paid Skins",null,{"$f":"COUNTIF(C6:C115,\"Y\")","v":0},"# of Skins",{"$f":"Z3","v":0},{"$f":"INDEX(F144:G155,MATCH($AT$4,G144:G155,0),1)","v":"2025-02-03"},null,{"v":2,"d":"$2"},null,{"$f":"COUNTIFS($B$6:$B$115,\"Y\",$C$6:$C$115,\"Y\")","v":0},{"$f":"COUNTIF(G6:G115,\"Y\")","v":0},{"$nulls":10},{"$f":"COUNTIFS(G6:G115,\"Y\",F6:F115,\"*\"&\">F\"&\"*\")","v":0},{"$f":"K2-V2","v":0},{"$f":"COUNTIF(F6:F115,\"*\"&\">F\"&\"*\")","v":0},{"$f":"Z2-X2","v":0},{"$f":"COUNTA(F6:F115)","v":0},{"$nulls":23},"Y"]
["Skins $ Fee",null,{"v":10,"d":"$10"},"Skins Value (EACH)",{"$f":"IF(E2=0,\"\",IF(ROUND(E1/E2,0)<0,ROUNDDOWN((E1-H2)/E2,0),ROUNDDOWN(E1/E2,0)))","v":""},"CAUTION:  Do NOT Change anything on cells with neon green or bright yellow background.  Hole scores and player info is OK to edit in cells B6 thru Y115.",null,{"$f":"IF($C$2=0,\"\",IFERROR(MIN(_xlfn.UNIQUE(INDIRECT(\"h6:h\"&$J$2+5),FALSE,TRUE)),\"\"))","v":""},{"$f":"IF($C$2=0,\"\",IFERROR(MIN(_xlfn.UNIQUE(INDIRECT(\"I6:I\"&$J$2+5),FALSE,TRUE)),\"\"))","v":""},{"$f":"IF($C$2=0,\"\",IFERROR(MIN(_xlfn.UNIQUE(INDIRECT(\"J6:J\"&$J$2+5),FALSE,TRUE)),\"\"))","v":""},{"$f":"IF($C$2=0,\"\",IFERROR(MIN(_xlfn.UNIQUE(INDIRECT(\"K6:K\"&$J$2+5),FALSE,TRUE)),\"\"))","v":""},{"$f":"IF($C$2=0,\"\",IFERROR(MIN(_xlfn.UNIQUE(INDIRECT(\"L6:L\"&$J$2+5),FALSE,TRUE)),\"\"))","v":""},{"$f":"IF($C$2=0,\"\",IFERROR(MIN(_xlfn.UNIQUE(INDIRECT(\"M6:M\"&$J$2+5),FALSE,TRUE)),\"\"))","v":""},{"$f":"IF($C$2=0,\"\",IFERROR(MIN(_xlfn.UNIQUE(INDIRECT(\"N6:N\"&$J$2+5),FALSE,TRUE)),\"\"))","v":""},{"$f":"IF($C$2=0,\"\",IFERROR(MIN(_xlfn.UNIQUE(INDIRECT(\"O6:O\"&$J$2+5),FALSE,TRUE)),\"\"))","v":""},{"$f":"IF($C$2=0,\"\",IFERROR(MIN(_xlfn.UNIQUE(INDIRECT(\"P6:P\"&$J$2+5),FALSE,TRUE)),\"\"))","v":""},{"$f":"IF($C$2=0,\"\",IFERROR(MIN(_xlfn.UNIQUE(INDIRECT(\"Q6:Q\"&$J$2+5),FALSE,TRUE)),\"\"))","v":""},{"$f":"IF($C$2=0,\"\",IFERROR(MIN(_xlfn.UNIQUE(INDIRECT(\"R6:R\"&$J$2+5),FALSE,TRUE)),\"\"))","v":""},{"$f":"IF($C$2=0,\"\",IFERROR(MIN(_xlfn.UNIQUE(INDIRECT(\"S6:S\"&$J$2+5),FALSE,TRUE)),\"\"))","v":""},{"$f":"IF($C$2=0,\"\",IFERROR(MIN(_xlfn.UNIQUE(INDIRECT(\"T6:T\"&$J$2+5),FALSE,TRUE)),\"\"))","v":""},{"$f":"IF($C$2=0,\"\",IFERROR(MIN(_xlfn.UNIQUE(INDIRECT(\"U6:U\"&$J$2+5),FALSE,TRUE)),\"\"))","v":""},{"$f":"IF($C$2=0,\"\",IFERROR(MIN(_xlfn.UNIQUE(INDIRECT(\"V6:V\"&$J$2+5),FALSE,TRUE)),\"\"))","v":""},{"$f":"IF($C$2=0,\"\",IFERROR(MIN(_xlfn.UNIQUE(INDIRECT(\"W6:W\"&$J$2+5),FALSE,TRUE)),\"\"))","v":""},{"$f":"IF($C$2=0,\"\",IFERROR(MIN(_xlfn.UNIQUE(INDIRECT(\"X6:X\"&$J$2+5),FALSE,TRUE)),\"\"))","v":""},{"$f":"IF($C$2=0,\"\",IFERROR(MIN(_xlfn.UNIQUE(INDIRECT(\"Y6:Y\"&$J$2+5),FALSE,TRUE)),\"\"))","v":""},{"$f":"SUM(Z6:Z114)","v":0},null,{"$f":"$C$1+5","v":5},{"$f":"$K$2+5","v":5}]
["$ to Collect",null,{"$f":"(C1-C2)*C3","v":{"v":0,"d":"$0"}}," Next\nCarryover",{"$f":"IF(E2=0,\"\",E1-(E2*E3))","v":""},null,null,{"$f":"VLOOKUP($AT$4,$G$144:$Y$155,2,0)","v":4},{"$f":"VLOOKUP($AT$4,$G$144:$Y$155,3,0)","v":5},{"$f":"VLOOKUP($AT$4,$G$144:$Y$155,4,0)","v":4},{"$f":"VLOOKUP($AT$4,$G$144:$Y$155,5,0)","v":3},{"$f":"VLOOKUP($AT$4,$G$144:$Y$155,6,0)","v":4},{"$f":"VLOOKUP($AT$4,$G$144:$Y$155,7,0)","v":4},{"$f":"VLOOKUP($AT$4,$G$144:$Y$155,8,0)","v":5},{"$f":"VLOOKUP($AT$4,$G$144:$Y$155,9,0)","v":3},{"$f":"VLOOKUP($AT$4,$G$144:$Y$155,10,0)","v":4},{"$f":"VLOOKUP($AT$4,$G$144:$Y$155,11,0)","v":5},{"$f":"VLOOKUP($AT$4,$G$144:$Y$155,12,0)","v":3},{"$f":"VLOOKUP($AT$4,$G$144:$Y$155,13,0)","v":4},{"$f":"VLOOKUP($AT$4,$G$144:$Y$155,14,0)","v":4},{"$f":"VLOOKUP($AT$4,$G$144:$Y$155,15,0)","v":3},{"$f":"VLOOKUP($AT$4,$G$144:$Y$155,16,0)","v":5},{"$f":"VLOOKUP($AT$4,$G$144:$Y$155,17,0)","v":4},{"$f":"VLOOKUP($AT$4,$G$144:$Y$155,18,0)","v":4},{"$f":"VLOOKUP($AT$4,$G$144:$Y$155,19,0)","v":4},{"$f":"SUM(H4:Y4)","v":72},{"$nulls":19},"CM"]
["#","IN\n\"Y\"","PAID\n\"Y\"","Club","Start Tee","Name","POSTED\n\"Y\"",{"$f":"IF($AT$4=\"WE1\",\"BK1\",IF($AT$4=\"WE2\",\"OF1\",1))","v":1},{"$f":"IF($AT$4=\"WE1\",\"BK2\",IF($AT$4=\"WE2\",\"OF2\",2))","v":2},{"$f":"IF($AT$4=\"WE1\",\"BK3\",IF($AT$4=\"WE2\",\"OF3\",3))","v":3},{"$f":"IF($AT$4=\"WE1\",\"BK4\",IF($AT$4=\"WE2\",\"OF4\",4))","v":4},{"$f":"IF($AT$4=\"WE1\",\"BK5\",IF($AT$4=\"WE2\",\"OF5\",5))","v":5},{"$f":"IF($AT$4=\"WE1\",\"BK6\",IF($AT$4=\"WE2\",\"OF6\",6))","v":6},{"$f":"IF($AT$4=\"WE1\",\"BK7\",IF($AT$4=\"WE2\",\"OF7\",7))","v":7},{"$f":"IF($AT$4=\"WE1\",\"BK8\",IF($AT$4=\"WE2\",\"OF8\",8))","v":8},{"$f":"IF($AT$4=\"WE1\",\"BK9\",IF($AT$4=\"WE2\",\"OF9\",9))","v":9},{"$f":"IF($AT$4=\"WE1\",\"BR1\",IF($AT$4=\"WE2\",\"BK1\",10))","v":10},{"$f":"IF($AT$4=\"WE1\",\"BR2\",IF($AT$4=\"WE2\",\"BK2\",11))","v":11},{"$f":"IF($AT$4=\"WE1\",\"BR3\",IF($AT$4=\"WE2\",\"BK3\",12))","v":12},{"$f":"IF($AT$4=\"WE1\",\"BR4\",IF($AT$4=\"WE2\",\"BK4\",13))","v":13},{"$f":"IF($AT$4=\"WE1\",\"BR5\",IF($AT$4=\"WE2\",\"BK5\",14))","v":14},{"$f":"IF($AT$4=\"WE1\",\"BR6\",IF($AT$4=\"WE2\",\"BK6\",15))","v":15},{"$f":"IF($AT$4=\"WE1\",\"BR7\",IF($AT$4=\"WE2\",\"BK7\",16))","v":16},{"$f":"IF($AT$4=\"WE1\",\"BR8\",IF($AT$4=\"WE2\",\"BK8\",17))","v":17},{"$f":"IF($AT$4=\"WE1\",\"BR9\",IF($AT$4=\"WE2\",\"BK9\",18))","v":18},"SKINS\n WON",null,1,2,3,4,5,6,7,8,9,10,11,12,13,14,15,16,17,18,"$\nWON",null,"SORTSKINS"]
[1,{"$nulls":24},{"$f":"IF(SUM(AB6:AS6)=0,\"\",SUM(AB6:AS6))","v":""},null,{"$f":"IF(H$3=\"\",\"\",IF(AND($B6=\"Y\",$C6=\"Y\",$G6=\"Y\",H6=H$3),1,\"\"))","v":""},{"$f":"IF(I$3=\"\",\"\",IF(AND($B6=\"Y\",$C6=\"Y\",$G6=\"Y\",I6=I$3),1,\"\"))","v":""},{"$f":"IF(J$3=\"\",\"\",IF(AND($B6=\"Y\",$C6=\"Y\",$G6=\"Y\",J6=J$3),1,\"\"))","v":""},{"$f":"IF(K$3=\"\",\"\",IF(AND($B6=\"Y\",$C6=\"Y\",$G6=\"Y\",K6=K$3),1,\"\"))","v":""},{"$f":"IF(L$3=\"\",\"\",IF(AND($B6=\"Y\",$C6=\"Y\",$G6=\"Y\",L6=L$3),1,\"\"))","v":""},{"$f":"IF(M$3=\"\",\"\",IF(AND($B6=\"Y\",$C6=\"Y\",$G6=\"Y\",M6=M$3),1,\"\"))","v":""},{"$f":"IF(N$3=\"\",\"\",IF(AND($B6=\"Y\",$C6=\"Y\",$G6=\"Y\",N6=N$3),1,\"\"))","v":""},{"$f":"IF(O$3=\"\",\"\",IF(AND($B6=\"Y\",$C6=\"Y\",$G6=\"Y\",O6=O$3),1,\"\"))","v":""},{"$f":"IF(P$3=\"\",\"\",IF(AND($B6=\"Y\",$C6=\"Y\",$G6=\"Y\",P6=P$3),1,\"\"))","v":""},{"$f":"IF(Q$3=\"\",\"\",IF(AND($B6=\"Y\",$C6=\"Y\",$G6=\"Y\",Q6=Q$3),1,\"\"))","v":""},{"$f":"IF(R$3=\"\",\"\",IF(AND($B6=\"Y\",$C6=\"Y\",$G6=\"Y\",R6=R$3),1,\"\"))","v":""},{"$f":"IF(S$3=\"\",\"\",IF(AND($B6=\"Y\",$C6=\"Y\",$G6=\"Y\",S6=S$3),1,\"\"))","v":""},{"$f":"IF(T$3=\"\",\"\",IF(AND($B6=\"Y\",$C6=\"Y\",$G6=\"Y\",T6=T$3),1,\"\"))","v":""},{"$f":"IF(U$3=\"\",\"\",IF(AND($B6=\"Y\",$C6=\"Y\",$G6=\"Y\",U6=U$3),1,\"\"))","v":""},{"$f":"IF(V$3=\"\",\"\",IF(AND($B6=\"Y\",$C6=\"Y\",$G6=\"Y\",V6=V$3),1,\"\"))","v":""},{"$f":"IF(W$3=\"\",\"\",IF(AND($B6=\"Y\",$C6=\"Y\",$G6=\"Y\",W6=W$3),1,\"\"))","v":""},{"$f":"IF(X$3=\"\",\"\",IF(AND($B6=\"Y\",$C6=\"Y\",$G6=\"Y\",X6=X$3),1,\"\"))","v":""},{"$f":"IF(Y$3=\"\",\"\",IF(AND($B6=\"Y\",$C6=\"Y\",$G6=\"Y\",Y6=Y$3),1,\"\"))","v":""},{"$f":"IF(B6<>\"Y\",\"\",IF(Z6=\"\",\"\",Z6*$E$3))","v":""},"    LEGEND (BACKGROUND COLOR)","1A",null,"#1 - 8:30"]
[2,{"$nulls":24},{"$f":"IF(SUM(AB7:AS7)=0,\"\",SUM(AB7:AS7))","v":""},null,{"$f":"IF(H$3=\"\",\"\",IF(AND($B7=\"Y\",$C7=\"Y\",$G7=\"Y\",H7=H$3),1,\"\"))","v":""},{"$f":"IF(I$3=\"\",\"\",IF(AND($B7=\"Y\",$C7=\"Y\",$G7=\"Y\",I7=I$3),1,\"\"))","v":""},{"$f":"IF(J$3=\"\",\"\",IF(AND($B7=\"Y\",$C7=\"Y\",$G7=\"Y\",J7=J$3),1,\"\"))","v":""},{"$f":"IF(K$3=\"\",\"\",IF(AND($B7=\"Y\",$C7=\"Y\",$G7=\"Y\",K7=K$3),1,\"\"))","v":""},{"$f":"IF(L$3=\"\",\"\",IF(AND($B7=\"Y\",$C7=\"Y\",$G7=\"Y\",L7=L$3),1,\"\"))","v":""},{"$f":"IF(M$3=\"\",\"\",IF(AND($B7=\"Y\",$C7=\"Y\",$G7=\"Y\",M7=M$3),1,\"\"))","v":""},{"$f":"IF(N$3=\"\",\"\",IF(AND($B7=\"Y\",$C7=\"Y\",$G7=\"Y\",N7=N$3),1,\"\"))","v":""},{"$f":"IF(O$3=\"\",\"\",IF(AND($B7=\"Y\",$C7=\"Y\",$G7=\"Y\",O7=O$3),1,\"\"))","v":""},{"$f":"IF(P$3=\"\",\"\",IF(AND($B7=\"Y\",$C7=\"Y\",$G7=\"Y\",P7=P$3),1,\"\"))","v":""},{"$f":"IF(Q$3=\"\",\"\",IF(AND($B7=\"Y\",$C7=\"Y\",$G7=\"Y\",Q7=Q$3),1,\"\"))","v":""},{"$f":"IF(R$3=\"\",\"\",IF(AND($B7=\"Y\",$C7=\"Y\",$G7=\"Y\",R7=R$3),1,\"\"))","v":""},{"$f":"IF(S$3=\"\",\"\",IF(AND($B7=\"Y\",$C7=\"Y\",$G7=\"Y\",S7=S$3),1,\"\"))","v":""},{"$f":"IF(T$3=\"\",\"\",IF(AND($B7=\"Y\",$C7=\"Y\",$G7=\"Y\",T7=T$3),1,\"\"))","v":""},{"$f":"IF(U$3=\"\",\"\",IF(AND($B7=\"Y\",$C7=\"Y\",$G7=\"Y\",U7=U$3),1,\"\"))","v":""},{"$f":"IF(V$3=\"\",\"\",IF(AND($B7=\"Y\",$C7=\"Y\",$G7=\"Y\",V7=V$3),1,\"\"))","v":""},{"$f":"IF(W$3=\"\",\"\",IF(AND($B7=\"Y\",$C7=\"Y\",$G7=\"Y\",W7=W$3),1,\"\"))","v":""},{"$f":"IF(X$3=\"\",\"\",IF(AND($B7=\"Y\",$C7=\"Y\",$G7=\"Y\",X7=X$3),1,\"\"))","v":""},{"$f":"IF(Y$3=\"\",\"\",IF(AND($B7=\"Y\",$C7=\"Y\",$G7=\"Y\",Y7=Y$3),1,\"\"))","v":""},{"$f":"IF(B7<>\"Y\",\"\",IF(Z7=\"\",\"\",Z7*$E$3))","v":""},"LIGHT BLUE - IN SKINS, NOT PAID","1B",null,"#10 - 8:30"]
[3,{"$nulls":24},{"$f":"IF(SUM(AB8:AS8)=0,\"\",SUM(AB8:AS8))","v":""},null,{"$f":"IF(H$3=\"\",\"\",IF(AND($B8=\"Y\",$C8=\"Y\",$G8=\"Y\",H8=H$3),1,\"\"))","v":""},{"$f":"IF(I$3=\"\",\"\",IF(AND($B8=\"Y\",$C8=\"Y\",$G8=\"Y\",I8=I$3),1,\"\"))","v":""},{"$f":"IF(J$3=\"\",\"\",IF(AND($B8=\"Y\",$C8=\"Y\",$G8=\"Y\",J8=J$3),1,\"\"))","v":""},{"$f":"IF(K$3=\"\",\"\",IF(AND($B8=\"Y\",$C8=\"Y\",$G8=\"Y\",K8=K$3),1,\"\"))","v":""},{"$f":"IF(L$3=\"\",\"\",IF(AND($B8=\"Y\",$C8=\"Y\",$G8=\"Y\",L8=L$3),1,\"\"))","v":""},{"$f":"IF(M$3=\"\",\"\",IF(AND($B8=\"Y\",$C8=\"Y\",$G8=\"Y\",M8=M$3),1,\"\"))","v":""},{"$f":"IF(N$3=\"\",\"\",IF(AND($B8=\"Y\",$C8=\"Y\",$G8=\"Y\",N8=N$3),1,\"\"))","v":""},{"$f":"IF(O$3=\"\",\"\",IF(AND($B8=\"Y\",$C8=\"Y\",$G8=\"Y\",O8=O$3),1,\"\"))","v":""},{"$f":"IF(P$3=\"\",\"\",IF(AND($B8=\"Y\",$C8=\"Y\",$G8=\"Y\",P8=P$3),1,\"\"))","v":""},{"$f":"IF(Q$3=\"\",\"\",IF(AND($B8=\"Y\",$C8=\"Y\",$G8=\"Y\",Q8=Q$3),1,\"\"))","v":""},{"$f":"IF(R$3=\"\",\"\",IF(AND($B8=\"Y\",$C8=\"Y\",$G8=\"Y\",R8=R$3),1,\"\"))","v":""},{"$f":"IF(S$3=\"\",\"\",IF(AND($B8=\"Y\",$C8=\"Y\",$G8=\"Y\",S8=S$3),1,\"\"))","v":""},{"$f":"IF(T$3=\"\",\"\",IF(AND($B8=\"Y\",$C8=\"Y\",$G8=\"Y\",T8=T$3),1,\"\"))","v":""},{"$f":"IF(U$3=\"\",\"\",IF(AND($B8=\"Y\",$C8=\"Y\",$G8=\"Y\",U8=U$3),1,\"\"))","v":""},{"$f":"IF(V$3=\"\",\"\",IF(AND($B8=\"Y\",$C8=\"Y\",$G8=\"Y\",V8=V$3),1,\"\"))","v":""},{"$f":"IF(W$3=\"\",\"\",IF(AND($B8=\"Y\",$C8=\"Y\",$G8=\"Y\",W8=W$3),1,\"\"))","v":""},{"$f":"IF(X$3=\"\",\"\",IF(AND($B8=\"Y\",$C8=\"Y\",$G8=\"Y\",X8=X$3),1,\"\"))","v":""},{"$f":"IF(Y$3=\"\",\"\",IF(AND($B8=\"Y\",$C8=\"Y\",$G8=\"Y\",Y8=Y$3),1,\"\"))","v":""},{"$f":"IF(B8<>\"Y\",\"\",IF(Z8=\"\",\"\",Z8*$E$3))","v":""},"LIGHT GREEN - \"NOT\" IN SKINS or NO DATA","2A",null,"#1 - 8:39"]
[4,{"$nulls":24},{"$f":"IF(SUM(AB9:AS9)=0,\"\",SUM(AB9:AS9))","v":""},null,{"$f":"IF(H$3=\"\",\"\",IF(AND($B9=\"Y\",$C9=\"Y\",$G9=\"Y\",H9=H$3),1,\"\"))","v":""},{"$f":"IF(I$3=\"\",\"\",IF(AND($B9=\"Y\",$C9=\"Y\",$G9=\"Y\",I9=I$3),1,\"\"))","v":""},{"$f":"IF(J$3=\"\",\"\",IF(AND($B9=\"Y\",$C9=\"Y\",$G9=\"Y\",J9=J$3),1,\"\"))","v":""},{"$f":"IF(K$3=\"\",\"\",IF(AND($B9=\"Y\",$C9=\"Y\",$G9=\"Y\",K9=K$3),1,\"\"))","v":""},{"$f":"IF(L$3=\"\",\"\",IF(AND($B9=\"Y\",$C9=\"Y\",$G9=\"Y\",L9=L$3),1,\"\"))","v":""},{"$f":"IF(M$3=\"\",\"\",IF(AND($B9=\"Y\",$C9=\"Y\",$G9=\"Y\",M9=M$3),1,\"\"))","v":""},{"$f":"IF(N$3=\"\",\"\",IF(AND($B9=\"Y\",$C9=\"Y\",$G9=\"Y\",N9=N$3),1,\"\"))","v":""},{"$f":"IF(O$3=\"\",\"\",IF(AND($B9=\"Y\",$C9=\"Y\",$G9=\"Y\",O9=O$3),1,\"\"))","v":""},{"$f":"IF(P$3=\"\",\"\",IF(AND($B9=\"Y\",$C9=\"Y\",$G9=\"Y\",P9=P$3),1,\"\"))","v":""},{"$f":"IF(Q$3=\"\",\"\",IF(AND($B9=\"Y\",$C9=\"Y\",$G9=\"Y\",Q9=Q$3),1,\"\"))","v":""},{"$f":"IF(R$3=\"\",\"\",IF(AND($B9=\"Y\",$C9=\"Y\",$G9=\"Y\",R9=R$3),1,\"\"))","v":""},{"$f":"IF(S$3=\"\",\"\",IF(AND($B9=\"Y\",$C9=\"Y\",$G9=\"Y\",S9=S$3),1,\"\"))","v":""},{"$f":"IF(T$3=\"\",\"\",IF(AND($B9=\"Y\",$C9=\"Y\",$G9=\"Y\",T9=T$3),1,\"\"))","v":""},{"$f":"IF(U$3=\"\",\"\",IF(AND($B9=\"Y\",$C9=\"Y\",$G9=\"Y\",U9=U$3),1,\"\"))","v":""},{"$f":"IF(V$3=\"\",\"\",IF(AND($B9=\"Y\",$C9=\"Y\",$G9=\"Y\",V9=V$3),1,\"\"))","v":""},{"$f":"IF(W$3=\"\",\"\",IF(AND($B9=\"Y\",$C9=\"Y\",$G9=\"Y\",W9=W$3),1,\"\"))","v":""},{"$f":"IF(X$3=\"\",\"\",IF(AND($B9=\"Y\",$C9=\"Y\",$G9=\"Y\",X9=X$3),1,\"\"))","v":""},{"$f":"IF(Y$3=\"\",\"\",IF(AND($B9=\"Y\",$C9=\"Y\",$G9=\"Y\",Y9=Y$3),1,\"\"))","v":""},{"$f":"IF(B9<>\"Y\",\"\",IF(Z9=\"\",\"\",Z9*$E$3))","v":""},"WHITE - IN SKINS AND PAID","2B",null,"#10 - 8:39"]
[5,{"$nulls":24},{"$f":"IF(SUM(AB10:AS10)=0,\"\",SUM(AB10:AS10))","v":""},null,{"$f":"IF(H$3=\"\",\"\",IF(AND($B10=\"Y\",$C10=\"Y\",$G10=\"Y\",H10=H$3),1,\"\"))","v":""},{"$f":"IF(I$3=\"\",\"\",IF(AND($B10=\"Y\",$C10=\"Y\",$G10=\"Y\",I10=I$3),1,\"\"))","v":""},{"$f":"IF(J$3=\"\",\"\",IF(AND($B10=\"Y\",$C10=\"Y\",$G10=\"Y\",J10=J$3),1,\"\"))","v":""},{"$f":"IF(K$3=\"\",\"\",IF(AND($B10=\"Y\",$C10=\"Y\",$G10=\"Y\",K10=K$3),1,\"\"))","v":""},{"$f":"IF(L$3=\"\",\"\",IF(AND($B10=\"Y\",$C10=\"Y\",$G10=\"Y\",L10=L$3),1,\"\"))","v":""},{"$f":"IF(M$3=\"\",\"\",IF(AND($B10=\"Y\",$C10=\"Y\",$G10=\"Y\",M10=M$3),1,\"\"))","v":""},{"$f":"IF(N$3=\"\",\"\",IF(AND($B10=\"Y\",$C10=\"Y\",$G10=\"Y\",N10=N$3),1,\"\"))","v":""},{"$f":"IF(O$3=\"\",\"\",IF(AND($B10=\"Y\",$C10=\"Y\",$G10=\"Y\",O10=O$3),1,\"\"))","v":""},{"$f":"IF(P$3=\"\",\"\",IF(AND($B10=\"Y\",$C10=\"Y\",$G10=\"Y\",P10=P$3),1,\"\"))","v":""},{"$f":"IF(Q$3=\"\",\"\",IF(AND($B10=\"Y\",$C10=\"Y\",$G10=\"Y\",Q10=Q$3),1,\"\"))","v":""},{"$f":"IF(R$3=\"\",\"\",IF(AND($B10=\"Y\",$C10=\"Y\",$G10=\"Y\",R10=R$3),1,\"\"))","v":""},{"$f":"IF(S$3=\"\",\"\",IF(AND($B10=\"Y\",$C10=\"Y\",$G10=\"Y\",S10=S$3),1,\"\"))","v":""},{"$f":"IF(T$3=\"\",\"\",IF(AND($B10=\"Y\",$C10=\"Y\",$G10=\"Y\",T10=T$3),1,\"\"))","v":""},{"$f":"IF(U$3=\"\",\"\",IF(AND($B10=\"Y\",$C10=\"Y\",$G10=\"Y\",U10=U$3),1,\"\"))","v":""},{"$f":"IF(V$3=\"\",\"\",IF(AND($B10=\"Y\",$C10=\"Y\",$G10=\"Y\",V10=V$3),1,\"\"))","v":""},{"$f":"IF(W$3=\"\",\"\",IF(AND($B10=\"Y\",$C10=\"Y\",$G10=\"Y\",W10=W$3),1,\"\"))","v":""},{"$f":"IF(X$3=\"\",\"\",IF(AND($B10=\"Y\",$C10=\"Y\",$G10=\"Y\",X10=X$3),1,\"\"))","v":""},{"$f":"IF(Y$3=\"\",\"\",IF(AND($B10=\"Y\",$C10=\"Y\",$G10=\"Y\",Y10=Y$3),1,\"\"))","v":""},{"$f":"IF(B10<>\"Y\",\"\",IF(Z10=\"\",\"\",Z10*$E$3))","v":""},"DARK GREEN - IN SKINS/PAID, SCORE NOT POSTED","3A",null,"#1 - 8:48"]
[6,{"$nulls":24},{"$f":"IF(SUM(AB11:AS11)=0,\"\",SUM(AB11:AS11))","v":""},null,{"$f":"IF(H$3=\"\",\"\",IF(AND($B11=\"Y\",$C11=\"Y\",$G11=\"Y\",H11=H$3),1,\"\"))","v":""},{"$f":"IF(I$3=\"\",\"\",IF(AND($B11=\"Y\",$C11=\"Y\",$G11=\"Y\",I11=I$3),1,\"\"))","v":""},{"$f":"IF(J$3=\"\",\"\",IF(AND($B11=\"Y\",$C11=\"Y\",$G11=\"Y\",J11=J$3),1,\"\"))","v":""},{"$f":"IF(K$3=\"\",\"\",IF(AND($B11=\"Y\",$C11=\"Y\",$G11=\"Y\",K11=K$3),1,\"\"))","v":""},{"$f":"IF(L$3=\"\",\"\",IF(AND($B11=\"Y\",$C11=\"Y\",$G11=\"Y\",L11=L$3),1,\"\"))","v":""},{"$f":"IF(M$3=\"\",\"\",IF(AND($B11=\"Y\",$C11=\"Y\",$G11=\"Y\",M11=M$3),1,\"\"))","v":""},{"$f":"IF(N$3=\"\",\"\",IF(AND($B11=\"Y\",$C11=\"Y\",$G11=\"Y\",N11=N$3),1,\"\"))","v":""},{"$f":"IF(O$3=\"\",\"\",IF(AND($B11=\"Y\",$C11=\"Y\",$G11=\"Y\",O11=O$3),1,\"\"))","v":""},{"$f":"IF(P$3=\"\",\"\",IF(AND($B11=\"Y\",$C11=\"Y\",$G11=\"Y\",P11=P$3),1,\"\"))","v":""},{"$f":"IF(Q$3=\"\",\"\",IF(AND($B11=\"Y\",$C11=\"Y\",$G11=\"Y\",Q11=Q$3),1,\"\"))","v":""},{"$f":"IF(R$3=\"\",\"\",IF(AND($B11=\"Y\",$C11=\"Y\",$G11=\"Y\",R11=R$3),1,\"\"))","v":""},{"$f":"IF(S$3=\"\",\"\",IF(AND($B11=\"Y\",$C11=\"Y\",$G11=\"Y\",S11=S$3),1,\"\"))","v":""},{"$f":"IF(T$3=\"\",\"\",IF(AND($B11=\"Y\",$C11=\"Y\",$G11=\"Y\",T11=T$3),1,\"\"))","v":""},{"$f":"IF(U$3=\"\",\"\",IF(AND($B11=\"Y\",$C11=\"Y\",$G11=\"Y\",U11=U$3),1,\"\"))","v":""},{"$f":"IF(V$3=\"\",\"\",IF(AND($B11=\"Y\",$C11=\"Y\",$G11=\"Y\",V11=V$3),1,\"\"))","v":""},{"$f":"IF(W$3=\"\",\"\",IF(AND($B11=\"Y\",$C11=\"Y\",$G11=\"Y\",W11=W$3),1,\"\"))","v":""},{"$f":"IF(X$3=\"\",\"\",IF(AND($B11=\"Y\",$C11=\"Y\",$G11=\"Y\",X11=X$3),1,\"\"))","v":""},{"$f":"IF(Y$3=\"\",\"\",IF(AND($B11=\"Y\",$C11=\"Y\",$G11=\"Y\",Y11=Y$3),1,\"\"))","v":""},{"$f":"IF(B11<>\"Y\",\"\",IF(Z11=\"\",\"\",Z11*$E$3))","v":""},"LIGHT GRAY - IN SKINS/PAID/POSTED - NO BIRDIES","3B",null,"#10 - 8:48"]
[7,{"$nulls":24},{"$f":"IF(SUM(AB12:AS12)=0,\"\",SUM(AB12:AS12))","v":""},null,{"$f":"IF(H$3=\"\",\"\",IF(AND($B12=\"Y\",$C12=\"Y\",$G12=\"Y\",H12=H$3),1,\"\"))","v":""},{"$f":"IF(I$3=\"\",\"\",IF(AND($B12=\"Y\",$C12=\"Y\",$G12=\"Y\",I12=I$3),1,\"\"))","v":""},{"$f":"IF(J$3=\"\",\"\",IF(AND($B12=\"Y\",$C12=\"Y\",$G12=\"Y\",J12=J$3),1,\"\"))","v":""},{"$f":"IF(K$3=\"\",\"\",IF(AND($B12=\"Y\",$C12=\"Y\",$G12=\"Y\",K12=K$3),1,\"\"))","v":""},{"$f":"IF(L$3=\"\",\"\",IF(AND($B12=\"Y\",$C12=\"Y\",$G12=\"Y\",L12=L$3),1,\"\"))","v":""},{"$f":"IF(M$3=\"\",\"\",IF(AND($B12=\"Y\",$C12=\"Y\",$G12=\"Y\",M12=M$3),1,\"\"))","v":""},{"$f":"IF(N$3=\"\",\"\",IF(AND($B12=\"Y\",$C12=\"Y\",$G12=\"Y\",N12=N$3),1,\"\"))","v":""},{"$f":"IF(O$3=\"\",\"\",IF(AND($B12=\"Y\",$C12=\"Y\",$G12=\"Y\",O12=O$3),1,\"\"))","v":""},{"$f":"IF(P$3=\"\",\"\",IF(AND($B12=\"Y\",$C12=\"Y\",$G12=\"Y\",P12=P$3),1,\"\"))","v":""},{"$f":"IF(Q$3=\"\",\"\",IF(AND($B12=\"Y\",$C12=\"Y\",$G12=\"Y\",Q12=Q$3),1,\"\"))","v":""},{"$f":"IF(R$3=\"\",\"\",IF(AND($B12=\"Y\",$C12=\"Y\",$G12=\"Y\",R12=R$3),1,\"\"))","v":""},{"$f":"IF(S$3=\"\",\"\",IF(AND($B12=\"Y\",$C12=\"Y\",$G12=\"Y\",S12=S$3),1,\"\"))","v":""},{"$f":"IF(T$3=\"\",\"\",IF(AND($B12=\"Y\",$C12=\"Y\",$G12=\"Y\",T12=T$3),1,\"\"))","v":""},{"$f":"IF(U$3=\"\",\"\",IF(AND($B12=\"Y\",$C12=\"Y\",$G12=\"Y\",U12=U$3),1,\"\"))","v":""},{"$f":"IF(V$3=\"\",\"\",IF(AND($B12=\"Y\",$C12=\"Y\",$G12=\"Y\",V12=V$3),1,\"\"))","v":""},{"$f":"IF(W$3=\"\",\"\",IF(AND($B12=\"Y\",$C12=\"Y\",$G12=\"Y\",W12=W$3),1,\"\"))","v":""},{"$f":"IF(X$3=\"\",\"\",IF(AND($B12=\"Y\",$C12=\"Y\",$G12=\"Y\",X12=X$3),1,\"\"))","v":""},{"$f":"IF(Y$3=\"\",\"\",IF(AND($B12=\"Y\",$C12=\"Y\",$G12=\"Y\",Y12=Y$3),1,\"\"))","v":""},{"$f":"IF(B12<>\"Y\",\"\",IF(Z12=\"\",\"\",Z12*$E$3))","v":""},"WHITE - IN SKINS/PAID/POSTED & SCORES POSTED","4A",null,"#1 - 8:57"]
[8,{"$nulls":24},{"$f":"IF(SUM(AB13:AS13)=0,\"\",SUM(AB13:AS13))","v":""},null,{"$f":"IF(H$3=\"\",\"\",IF(AND($B13=\"Y\",$C13=\"Y\",$G13=\"Y\",H13=H$3),1,\"\"))","v":""},{"$f":"IF(I$3=\"\",\"\",IF(AND($B13=\"Y\",$C13=\"Y\",$G13=\"Y\",I13=I$3),1,\"\"))","v":""},{"$f":"IF(J$3=\"\",\"\",IF(AND($B13=\"Y\",$C13=\"Y\",$G13=\"Y\",J13=J$3),1,\"\"))","v":""},{"$f":"IF(K$3=\"\",\"\",IF(AND($B13=\"Y\",$C13=\"Y\",$G13=\"Y\",K13=K$3),1,\"\"))","v":""},{"$f":"IF(L$3=\"\",\"\",IF(AND($B13=\"Y\",$C13=\"Y\",$G13=\"Y\",L13=L$3),1,\"\"))","v":""},{"$f":"IF(M$3=\"\",\"\",IF(AND($B13=\"Y\",$C13=\"Y\",$G13=\"Y\",M13=M$3),1,\"\"))","v":""},{"$f":"IF(N$3=\"\",\"\",IF(AND($B13=\"Y\",$C13=\"Y\",$G13=\"Y\",N13=N$3),1,\"\"))","v":""},{"$f":"IF(O$3=\"\",\"\",IF(AND($B13=\"Y\",$C13=\"Y\",$G13=\"Y\",O13=O$3),1,\"\"))","v":""},{"$f":"IF(P$3=\"\",\"\",IF(AND($B13=\"Y\",$C13=\"Y\",$G13=\"Y\",P13=P$3),1,\"\"))","v":""},{"$f":"IF(Q$3=\"\",\"\",IF(AND($B13=\"Y\",$C13=\"Y\",$G13=\"Y\",Q13=Q$3),1,\"\"))","v":""},{"$f":"IF(R$3=\"\",\"\",IF(AND($B13=\"Y\",$C13=\"Y\",$G13=\"Y\",R13=R$3),1,\"\"))","v":""},{"$f":"IF(S$3=\"\",\"\",IF(AND($B13=\"Y\",$C13=\"Y\",$G13=\"Y\",S13=S$3),1,\"\"))","v":""},{"$f":"IF(T$3=\"\",\"\",IF(AND($B13=\"Y\",$C13=\"Y\",$G13=\"Y\",T13=T$3),1,\"\"))","v":""},{"$f":"IF(U$3=\"\",\"\",IF(AND($B13=\"Y\",$C13=\"Y\",$G13=\"Y\",U13=U$3),1,\"\"))","v":""},{"$f":"IF(V$3=\"\",\"\",IF(AND($B13=\"Y\",$C13=\"Y\",$G13=\"Y\",V13=V$3),1,\"\"))","v":""},{"$f":"IF(W$3=\"\",\"\",IF(AND($B13=\"Y\",$C13=\"Y\",$G13=\"Y\",W13=W$3),1,\"\"))","v":""},{"$f":"IF(X$3=\"\",\"\",IF(AND($B13=\"Y\",$C13=\"Y\",$G13=\"Y\",X13=X$3),1,\"\"))","v":""},{"$f":"IF(Y$3=\"\",\"\",IF(AND($B13=\"Y\",$C13=\"Y\",$G13=\"Y\",Y13=Y$3),1,\"\"))","v":""},{"$f":"IF(B13<>\"Y\",\"\",IF(Z13=\"\",\"\",Z13*$E$3))","v":""},"RED (PLAYER INFO AREA) - PAID BUT NOT IN SKINS","4B",null,"#10 - 8:57"]
[9,{"$nulls":24},{"$f":"IF(SUM(AB14:AS14)=0,\"\",SUM(AB14:AS14))","v":""},null,{"$f":"IF(H$3=\"\",\"\",IF(AND($B14=\"Y\",$C14=\"Y\",$G14=\"Y\",H14=H$3),1,\"\"))","v":""},{"$f":"IF(I$3=\"\",\"\",IF(AND($B14=\"Y\",$C14=\"Y\",$G14=\"Y\",I14=I$3),1,\"\"))","v":""},{"$f":"IF(J$3=\"\",\"\",IF(AND($B14=\"Y\",$C14=\"Y\",$G14=\"Y\",J14=J$3),1,\"\"))","v":""},{"$f":"IF(K$3=\"\",\"\",IF(AND($B14=\"Y\",$C14=\"Y\",$G14=\"Y\",K14=K$3),1,\"\"))","v":""},{"$f":"IF(L$3=\"\",\"\",IF(AND($B14=\"Y\",$C14=\"Y\",$G14=\"Y\",L14=L$3),1,\"\"))","v":""},{"$f":"IF(M$3=\"\",\"\",IF(AND($B14=\"Y\",$C14=\"Y\",$G14=\"Y\",M14=M$3),1,\"\"))","v":""},{"$f":"IF(N$3=\"\",\"\",IF(AND($B14=\"Y\",$C14=\"Y\",$G14=\"Y\",N14=N$3),1,\"\"))","v":""},{"$f":"IF(O$3=\"\",\"\",IF(AND($B14=\"Y\",$C14=\"Y\",$G14=\"Y\",O14=O$3),1,\"\"))","v":""},{"$f":"IF(P$3=\"\",\"\",IF(AND($B14=\"Y\",$C14=\"Y\",$G14=\"Y\",P14=P$3),1,\"\"))","v":""},{"$f":"IF(Q$3=\"\",\"\",IF(AND($B14=\"Y\",$C14=\"Y\",$G14=\"Y\",Q14=Q$3),1,\"\"))","v":""},{"$f":"IF(R$3=\"\",\"\",IF(AND($B14=\"Y\",$C14=\"Y\",$G14=\"Y\",R14=R$3),1,\"\"))","v":""},{"$f":"IF(S$3=\"\",\"\",IF(AND($B14=\"Y\",$C14=\"Y\",$G14=\"Y\",S14=S$3),1,\"\"))","v":""},{"$f":"IF(T$3=\"\",\"\",IF(AND($B14=\"Y\",$C14=\"Y\",$G14=\"Y\",T14=T$3),1,\"\"))","v":""},{"$f":"IF(U$3=\"\",\"\",IF(AND($B14=\"Y\",$C14=\"Y\",$G14=\"Y\",U14=U$3),1,\"\"))","v":""},{"$f":"IF(V$3=\"\",\"\",IF(AND($B14=\"Y\",$C14=\"Y\",$G14=\"Y\",V14=V$3),1,\"\"))","v":""},{"$f":"IF(W$3=\"\",\"\",IF(AND($B14=\"Y\",$C14=\"Y\",$G14=\"Y\",W14=W$3),1,\"\"))","v":""},{"$f":"IF(X$3=\"\",\"\",IF(AND($B14=\"Y\",$C14=\"Y\",$G14=\"Y\",X14=X$3),1,\"\"))","v":""},{"$f":"IF(Y$3=\"\",\"\",IF(AND($B14=\"Y\",$C14=\"Y\",$G14=\"Y\",Y14=Y$3),1,\"\"))","v":""},{"$f":"IF(B14<>\"Y\",\"\",IF(Z14=\"\",\"\",Z14*$E$3))","v":""},null,"5A",null,"#1 - 9:06"]
[10,{"$nulls":24},{"$f":"IF(SUM(AB15:AS15)=0,\"\",SUM(AB15:AS15))","v":""},null,{"$f":"IF(H$3=\"\",\"\",IF(AND($B15=\"Y\",$C15=\"Y\",$G15=\"Y\",H15=H$3),1,\"\"))","v":""},{"$f":"IF(I$3=\"\",\"\",IF(AND($B15=\"Y\",$C15=\"Y\",$G15=\"Y\",I15=I$3),1,\"\"))","v":""},{"$f":"IF(J$3=\"\",\"\",IF(AND($B15=\"Y\",$C15=\"Y\",$G15=\"Y\",J15=J$3),1,\"\"))","v":""},{"$f":"IF(K$3=\"\",\"\",IF(AND($B15=\"Y\",$C15=\"Y\",$G15=\"Y\",K15=K$3),1,\"\"))","v":""},{"$f":"IF(L$3=\"\",\"\",IF(AND($B15=\"Y\",$C15=\"Y\",$G15=\"Y\",L15=L$3),1,\"\"))","v":""},{"$f":"IF(M$3=\"\",\"\",IF(AND($B15=\"Y\",$C15=\"Y\",$G15=\"Y\",M15=M$3),1,\"\"))","v":""},{"$f":"IF(N$3=\"\",\"\",IF(AND($B15=\"Y\",$C15=\"Y\",$G15=\"Y\",N15=N$3),1,\"\"))","v":""},{"$f":"IF(O$3=\"\",\"\",IF(AND($B15=\"Y\",$C15=\"Y\",$G15=\"Y\",O15=O$3),1,\"\"))","v":""},{"$f":"IF(P$3=\"\",\"\",IF(AND($B15=\"Y\",$C15=\"Y\",$G15=\"Y\",P15=P$3),1,\"\"))","v":""},{"$f":"IF(Q$3=\"\",\"\",IF(AND($B15=\"Y\",$C15=\"Y\",$G15=\"Y\",Q15=Q$3),1,\"\"))","v":""},{"$f":"IF(R$3=\"\",\"\",IF(AND($B15=\"Y\",$C15=\"Y\",$G15=\"Y\",R15=R$3),1,\"\"))","v":""},{"$f":"IF(S$3=\"\",\"\",IF(AND($B15=\"Y\",$C15=\"Y\",$G15=\"Y\",S15=S$3),1,\"\"))","v":""},{"$f":"IF(T$3=\"\",\"\",IF(AND($B15=\"Y\",$C15=\"Y\",$G15=\"Y\",T15=T$3),1,\"\"))","v":""},{"$f":"IF(U$3=\"\",\"\",IF(AND($B15=\"Y\",$C15=\"Y\",$G15=\"Y\",U15=U$3),1,\"\"))","v":""},{"$f":"IF(V$3=\"\",\"\",IF(AND($B15=\"Y\",$C15=\"Y\",$G15=\"Y\",V15=V$3),1,\"\"))","v":""},{"$f":"IF(W$3=\"\",\"\",IF(AND($B15=\"Y\",$C15=\"Y\",$G15=\"Y\",W15=W$3),1,\"\"))","v":""},{"$f":"IF(X$3=\"\",\"\",IF(AND($B15=\"Y\",$C15=\"Y\",$G15=\"Y\",X15=X$3),1,\"\"))","v":""},{"$f":"IF(Y$3=\"\",\"\",IF(AND($B15=\"Y\",$C15=\"Y\",$G15=\"Y\",Y15=Y$3),1,\"\"))","v":""},{"$f":"IF(B15<>\"Y\",\"\",IF(Z15=\"\",\"\",Z15*$E$3))","v":""},"NOTE","5B",null,"#10 - 9:06"]
[11,{"$nulls":24},{"$f":"IF(SUM(AB16:AS16)=0,\"\",SUM(AB16:AS16))","v":""},null,{"$f":"IF(H$3=\"\",\"\",IF(AND($B16=\"Y\",$C16=\"Y\",$G16=\"Y\",H16=H$3),1,\"\"))","v":""},{"$f":"IF(I$3=\"\",\"\",IF(AND($B16=\"Y\",$C16=\"Y\",$G16=\"Y\",I16=I$3),1,\"\"))","v":""},{"$f":"IF(J$3=\"\",\"\",IF(AND($B16=\"Y\",$C16=\"Y\",$G16=\"Y\",J16=J$3),1,\"\"))","v":""},{"$f":"IF(K$3=\"\",\"\",IF(AND($B16=\"Y\",$C16=\"Y\",$G16=\"Y\",K16=K$3),1,\"\"))","v":""},{"$f":"IF(L$3=\"\",\"\",IF(AND($B16=\"Y\",$C16=\"Y\",$G16=\"Y\",L16=L$3),1,\"\"))","v":""},{"$f":"IF(M$3=\"\",\"\",IF(AND($B16=\"Y\",$C16=\"Y\",$G16=\"Y\",M16=M$3),1,\"\"))","v":""},{"$f":"IF(N$3=\"\",\"\",IF(AND($B16=\"Y\",$C16=\"Y\",$G16=\"Y\",N16=N$3),1,\"\"))","v":""},{"$f":"IF(O$3=\"\",\"\",IF(AND($B16=\"Y\",$C16=\"Y\",$G16=\"Y\",O16=O$3),1,\"\"))","v":""},{"$f":"IF(P$3=\"\",\"\",IF(AND($B16=\"Y\",$C16=\"Y\",$G16=\"Y\",P16=P$3),1,\"\"))","v":""},{"$f":"IF(Q$3=\"\",\"\",IF(AND($B16=\"Y\",$C16=\"Y\",$G16=\"Y\",Q16=Q$3),1,\"\"))","v":""},{"$f":"IF(R$3=\"\",\"\",IF(AND($B16=\"Y\",$C16=\"Y\",$G16=\"Y\",R16=R$3),1,\"\"))","v":""},{"$f":"IF(S$3=\"\",\"\",IF(AND($B16=\"Y\",$C16=\"Y\",$G16=\"Y\",S16=S$3),1,\"\"))","v":""},{"$f":"IF(T$3=\"\",\"\",IF(AND($B16=\"Y\",$C16=\"Y\",$G16=\"Y\",T16=T$3),1,\"\"))","v":""},{"$f":"IF(U$3=\"\",\"\",IF(AND($B16=\"Y\",$C16=\"Y\",$G16=\"Y\",U16=U$3),1,\"\"))","v":""},{"$f":"IF(V$3=\"\",\"\",IF(AND($B16=\"Y\",$C16=\"Y\",$G16=\"Y\",V16=V$3),1,\"\"))","v":""},{"$f":"IF(W$3=\"\",\"\",IF(AND($B16=\"Y\",$C16=\"Y\",$G16=\"Y\",W16=W$3),1,\"\"))","v":""},{"$f":"IF(X$3=\"\",\"\",IF(AND($B16=\"Y\",$C16=\"Y\",$G16=\"Y\",X16=X$3),1,\"\"))","v":""},{"$f":"IF(Y$3=\"\",\"\",IF(AND($B16=\"Y\",$C16=\"Y\",$G16=\"Y\",Y16=Y$3),1,\"\"))","v":""},{"$f":"IF(B16<>\"Y\",\"\",IF(Z16=\"\",\"\",Z16*$E$3))","v":""},null,"6A",null,"#1 - 9:15"]
[12,{"$nulls":24},{"$f":"IF(SUM(AB17:AS17)=0,\"\",SUM(AB17:AS17))","v":""},null,{"$f":"IF(H$3=\"\",\"\",IF(AND($B17=\"Y\",$C17=\"Y\",$G17=\"Y\",H17=H$3),1,\"\"))","v":""},{"$f":"IF(I$3=\"\",\"\",IF(AND($B17=\"Y\",$C17=\"Y\",$G17=\"Y\",I17=I$3),1,\"\"))","v":""},{"$f":"IF(J$3=\"\",\"\",IF(AND($B17=\"Y\",$C17=\"Y\",$G17=\"Y\",J17=J$3),1,\"\"))","v":""},{"$f":"IF(K$3=\"\",\"\",IF(AND($B17=\"Y\",$C17=\"Y\",$G17=\"Y\",K17=K$3),1,\"\"))","v":""},{"$f":"IF(L$3=\"\",\"\",IF(AND($B17=\"Y\",$C17=\"Y\",$G17=\"Y\",L17=L$3),1,\"\"))","v":""},{"$f":"IF(M$3=\"\",\"\",IF(AND($B17=\"Y\",$C17=\"Y\",$G17=\"Y\",M17=M$3),1,\"\"))","v":""},{"$f":"IF(N$3=\"\",\"\",IF(AND($B17=\"Y\",$C17=\"Y\",$G17=\"Y\",N17=N$3),1,\"\"))","v":""},{"$f":"IF(O$3=\"\",\"\",IF(AND($B17=\"Y\",$C17=\"Y\",$G17=\"Y\",O17=O$3),1,\"\"))","v":""},{"$f":"IF(P$3=\"\",\"\",IF(AND($B17=\"Y\",$C17=\"Y\",$G17=\"Y\",P17=P$3),1,\"\"))","v":""},{"$f":"IF(Q$3=\"\",\"\",IF(AND($B17=\"Y\",$C17=\"Y\",$G17=\"Y\",Q17=Q$3),1,\"\"))","v":""},{"$f":"IF(R$3=\"\",\"\",IF(AND($B17=\"Y\",$C17=\"Y\",$G17=\"Y\",R17=R$3),1,\"\"))","v":""},{"$f":"IF(S$3=\"\",\"\",IF(AND($B17=\"Y\",$C17=\"Y\",$G17=\"Y\",S17=S$3),1,\"\"))","v":""},{"$f":"IF(T$3=\"\",\"\",IF(AND($B17=\"Y\",$C17=\"Y\",$G17=\"Y\",T17=T$3),1,\"\"))","v":""},{"$f":"IF(U$3=\"\",\"\",IF(AND($B17=\"Y\",$C17=\"Y\",$G17=\"Y\",U17=U$3),1,\"\"))","v":""},{"$f":"IF(V$3=\"\",\"\",IF(AND($B17=\"Y\",$C17=\"Y\",$G17=\"Y\",V17=V$3),1,\"\"))","v":""},{"$f":"IF(W$3=\"\",\"\",IF(AND($B17=\"Y\",$C17=\"Y\",$G17=\"Y\",W17=W$3),1,\"\"))","v":""},{"$f":"IF(X$3=\"\",\"\",IF(AND($B17=\"Y\",$C17=\"Y\",$G17=\"Y\",X17=X$3),1,\"\"))","v":""},{"$f":"IF(Y$3=\"\",\"\",IF(AND($B17=\"Y\",$C17=\"Y\",$G17=\"Y\",Y17=Y$3),1,\"\"))","v":""},{"$f":"IF(B17<>\"Y\",\"\",IF(Z17=\"\",\"\",Z17*$E$3))","v":""},null,"6B",null,"#10 - 9:15"]
[13,{"$nulls":24},{"$f":"IF(SUM(AB18:AS18)=0,\"\",SUM(AB18:AS18))","v":""},null,{"$f":"IF(H$3=\"\",\"\",IF(AND($B18=\"Y\",$C18=\"Y\",$G18=\"Y\",H18=H$3),1,\"\"))","v":""},{"$f":"IF(I$3=\"\",\"\",IF(AND($B18=\"Y\",$C18=\"Y\",$G18=\"Y\",I18=I$3),1,\"\"))","v":""},{"$f":"IF(J$3=\"\",\"\",IF(AND($B18=\"Y\",$C18=\"Y\",$G18=\"Y\",J18=J$3),1,\"\"))","v":""},{"$f":"IF(K$3=\"\",\"\",IF(AND($B18=\"Y\",$C18=\"Y\",$G18=\"Y\",K18=K$3),1,\"\"))","v":""},{"$f":"IF(L$3=\"\",\"\",IF(AND($B18=\"Y\",$C18=\"Y\",$G18=\"Y\",L18=L$3),1,\"\"))","v":""},{"$f":"IF(M$3=\"\",\"\",IF(AND($B18=\"Y\",$C18=\"Y\",$G18=\"Y\",M18=M$3),1,\"\"))","v":""},{"$f":"IF(N$3=\"\",\"\",IF(AND($B18=\"Y\",$C18=\"Y\",$G18=\"Y\",N18=N$3),1,\"\"))","v":""},{"$f":"IF(O$3=\"\",\"\",IF(AND($B18=\"Y\",$C18=\"Y\",$G18=\"Y\",O18=O$3),1,\"\"))","v":""},{"$f":"IF(P$3=\"\",\"\",IF(AND($B18=\"Y\",$C18=\"Y\",$G18=\"Y\",P18=P$3),1,\"\"))","v":""},{"$f":"IF(Q$3=\"\",\"\",IF(AND($B18=\"Y\",$C18=\"Y\",$G18=\"Y\",Q18=Q$3),1,\"\"))","v":""},{"$f":"IF(R$3=\"\",\"\",IF(AND($B18=\"Y\",$C18=\"Y\",$G18=\"Y\",R18=R$3),1,\"\"))","v":""},{"$f":"IF(S$3=\"\",\"\",IF(AND($B18=\"Y\",$C18=\"Y\",$G18=\"Y\",S18=S$3),1,\"\"))","v":""},{"$f":"IF(T$3=\"\",\"\",IF(AND($B18=\"Y\",$C18=\"Y\",$G18=\"Y\",T18=T$3),1,\"\"))","v":""},{"$f":"IF(U$3=\"\",\"\",IF(AND($B18=\"Y\",$C18=\"Y\",$G18=\"Y\",U18=U$3),1,\"\"))","v":""},{"$f":"IF(V$3=\"\",\"\",IF(AND($B18=\"Y\",$C18=\"Y\",$G18=\"Y\",V18=V$3),1,\"\"))","v":""},{"$f":"IF(W$3=\"\",\"\",IF(AND($B18=\"Y\",$C18=\"Y\",$G18=\"Y\",W18=W$3),1,\"\"))","v":""},{"$f":"IF(X$3=\"\",\"\",IF(AND($B18=\"Y\",$C18=\"Y\",$G18=\"Y\",X18=X$3),1,\"\"))","v":""},{"$f":"IF(Y$3=\"\",\"\",IF(AND($B18=\"Y\",$C18=\"Y\",$G18=\"Y\",Y18=Y$3),1,\"\"))","v":""},{"$f":"IF(B18<>\"Y\",\"\",IF(Z18=\"\",\"\",Z18*$E$3))","v":""},null,"7A",null,"#1 - 9:24"]
[14,{"$nulls":24},{"$f":"IF(SUM(AB19:AS19)=0,\"\",SUM(AB19:AS19))","v":""},null,{"$f":"IF(H$3=\"\",\"\",IF(AND($B19=\"Y\",$C19=\"Y\",$G19=\"Y\",H19=H$3),1,\"\"))","v":""},{"$f":"IF(I$3=\"\",\"\",IF(AND($B19=\"Y\",$C19=\"Y\",$G19=\"Y\",I19=I$3),1,\"\"))","v":""},{"$f":"IF(J$3=\"\",\"\",IF(AND($B19=\"Y\",$C19=\"Y\",$G19=\"Y\",J19=J$3),1,\"\"))","v":""},{"$f":"IF(K$3=\"\",\"\",IF(AND($B19=\"Y\",$C19=\"Y\",$G19=\"Y\",K19=K$3),1,\"\"))","v":""},{"$f":"IF(L$3=\"\",\"\",IF(AND($B19=\"Y\",$C19=\"Y\",$G19=\"Y\",L19=L$3),1,\"\"))","v":""},{"$f":"IF(M$3=\"\",\"\",IF(AND($B19=\"Y\",$C19=\"Y\",$G19=\"Y\",M19=M$3),1,\"\"))","v":""},{"$f":"IF(N$3=\"\",\"\",IF(AND($B19=\"Y\",$C19=\"Y\",$G19=\"Y\",N19=N$3),1,\"\"))","v":""},{"$f":"IF(O$3=\"\",\"\",IF(AND($B19=\"Y\",$C19=\"Y\",$G19=\"Y\",O19=O$3),1,\"\"))","v":""},{"$f":"IF(P$3=\"\",\"\",IF(AND($B19=\"Y\",$C19=\"Y\",$G19=\"Y\",P19=P$3),1,\"\"))","v":""},{"$f":"IF(Q$3=\"\",\"\",IF(AND($B19=\"Y\",$C19=\"Y\",$G19=\"Y\",Q19=Q$3),1,\"\"))","v":""},{"$f":"IF(R$3=\"\",\"\",IF(AND($B19=\"Y\",$C19=\"Y\",$G19=\"Y\",R19=R$3),1,\"\"))","v":""},{"$f":"IF(S$3=\"\",\"\",IF(AND($B19=\"Y\",$C19=\"Y\",$G19=\"Y\",S19=S$3),1,\"\"))","v":""},{"$f":"IF(T$3=\"\",\"\",IF(AND($B19=\"Y\",$C19=\"Y\",$G19=\"Y\",T19=T$3),1,\"\"))","v":""},{"$f":"IF(U$3=\"\",\"\",IF(AND($B19=\"Y\",$C19=\"Y\",$G19=\"Y\",U19=U$3),1,\"\"))","v":""},{"$f":"IF(V$3=\"\",\"\",IF(AND($B19=\"Y\",$C19=\"Y\",$G19=\"Y\",V19=V$3),1,\"\"))","v":""},{"$f":"IF(W$3=\"\",\"\",IF(AND($B19=\"Y\",$C19=\"Y\",$G19=\"Y\",W19=W$3),1,\"\"))","v":""},{"$f":"IF(X$3=\"\",\"\",IF(AND($B19=\"Y\",$C19=\"Y\",$G19=\"Y\",X19=X$3),1,\"\"))","v":""},{"$f":"IF(Y$3=\"\",\"\",IF(AND($B19=\"Y\",$C19=\"Y\",$G19=\"Y\",Y19=Y$3),1,\"\"))","v":""},{"$f":"IF(B19<>\"Y\",\"\",IF(Z19=\"\",\"\",Z19*$E$3))","v":""},null,"7B",null,"#10 - 9:24"]
[15,{"$nulls":24},{"$f":"IF(SUM(AB20:AS20)=0,\"\",SUM(AB20:AS20))","v":""},null,{"$f":"IF(H$3=\"\",\"\",IF(AND($B20=\"Y\",$C20=\"Y\",$G20=\"Y\",H20=H$3),1,\"\"))","v":""},{"$f":"IF(I$3=\"\",\"\",IF(AND($B20=\"Y\",$C20=\"Y\",$G20=\"Y\",I20=I$3),1,\"\"))","v":""},{"$f":"IF(J$3=\"\",\"\",IF(AND($B20=\"Y\",$C20=\"Y\",$G20=\"Y\",J20=J$3),1,\"\"))","v":""},{"$f":"IF(K$3=\"\",\"\",IF(AND($B20=\"Y\",$C20=\"Y\",$G20=\"Y\",K20=K$3),1,\"\"))","v":""},{"$f":"IF(L$3=\"\",\"\",IF(AND($B20=\"Y\",$C20=\"Y\",$G20=\"Y\",L20=L$3),1,\"\"))","v":""},{"$f":"IF(M$3=\"\",\"\",IF(AND($B20=\"Y\",$C20=\"Y\",$G20=\"Y\",M20=M$3),1,\"\"))","v":""},{"$f":"IF(N$3=\"\",\"\",IF(AND($B20=\"Y\",$C20=\"Y\",$G20=\"Y\",N20=N$3),1,\"\"))","v":""},{"$f":"IF(O$3=\"\",\"\",IF(AND($B20=\"Y\",$C20=\"Y\",$G20=\"Y\",O20=O$3),1,\"\"))","v":""},{"$f":"IF(P$3=\"\",\"\",IF(AND($B20=\"Y\",$C20=\"Y\",$G20=\"Y\",P20=P$3),1,\"\"))","v":""},{"$f":"IF(Q$3=\"\",\"\",IF(AND($B20=\"Y\",$C20=\"Y\",$G20=\"Y\",Q20=Q$3),1,\"\"))","v":""},{"$f":"IF(R$3=\"\",\"\",IF(AND($B20=\"Y\",$C20=\"Y\",$G20=\"Y\",R20=R$3),1,\"\"))","v":""},{"$f":"IF(S$3=\"\",\"\",IF(AND($B20=\"Y\",$C20=\"Y\",$G20=\"Y\",S20=S$3),1,\"\"))","v":""},{"$f":"IF(T$3=\"\",\"\",IF(AND($B20=\"Y\",$C20=\"Y\",$G20=\"Y\",T20=T$3),1,\"\"))","v":""},{"$f":"IF(U$3=\"\",\"\",IF(AND($B20=\"Y\",$C20=\"Y\",$G20=\"Y\",U20=U$3),1,\"\"))","v":""},{"$f":"IF(V$3=\"\",\"\",IF(AND($B20=\"Y\",$C20=\"Y\",$G20=\"Y\",V20=V$3),1,\"\"))","v":""},{"$f":"IF(W$3=\"\",\"\",IF(AND($B20=\"Y\",$C20=\"Y\",$G20=\"Y\",W20=W$3),1,\"\"))","v":""},{"$f":"IF(X$3=\"\",\"\",IF(AND($B20=\"Y\",$C20=\"Y\",$G20=\"Y\",X20=X$3),1,\"\"))","v":""},{"$f":"IF(Y$3=\"\",\"\",IF(AND($B20=\"Y\",$C20=\"Y\",$G20=\"Y\",Y20=Y$3),1,\"\"))","v":""},{"$f":"IF(B20<>\"Y\",\"\",IF(Z20=\"\",\"\",Z20*$E$3))","v":""},null,"8A",null,"#1 - 9:33"]
[16,{"$nulls":24},{"$f":"IF(SUM(AB21:AS21)=0,\"\",SUM(AB21:AS21))","v":""},null,{"$f":"IF(H$3=\"\",\"\",IF(AND($B21=\"Y\",$C21=\"Y\",$G21=\"Y\",H21=H$3),1,\"\"))","v":""},{"$f":"IF(I$3=\"\",\"\",IF(AND($B21=\"Y\",$C21=\"Y\",$G21=\"Y\",I21=I$3),1,\"\"))","v":""},{"$f":"IF(J$3=\"\",\"\",IF(AND($B21=\"Y\",$C21=\"Y\",$G21=\"Y\",J21=J$3),1,\"\"))","v":""},{"$f":"IF(K$3=\"\",\"\",IF(AND($B21=\"Y\",$C21=\"Y\",$G21=\"Y\",K21=K$3),1,\"\"))","v":""},{"$f":"IF(L$3=\"\",\"\",IF(AND($B21=\"Y\",$C21=\"Y\",$G21=\"Y\",L21=L$3),1,\"\"))","v":""},{"$f":"IF(M$3=\"\",\"\",IF(AND($B21=\"Y\",$C21=\"Y\",$G21=\"Y\",M21=M$3),1,\"\"))","v":""},{"$f":"IF(N$3=\"\",\"\",IF(AND($B21=\"Y\",$C21=\"Y\",$G21=\"Y\",N21=N$3),1,\"\"))","v":""},{"$f":"IF(O$3=\"\",\"\",IF(AND($B21=\"Y\",$C21=\"Y\",$G21=\"Y\",O21=O$3),1,\"\"))","v":""},{"$f":"IF(P$3=\"\",\"\",IF(AND($B21=\"Y\",$C21=\"Y\",$G21=\"Y\",P21=P$3),1,\"\"))","v":""},{"$f":"IF(Q$3=\"\",\"\",IF(AND($B21=\"Y\",$C21=\"Y\",$G21=\"Y\",Q21=Q$3),1,\"\"))","v":""},{"$f":"IF(R$3=\"\",\"\",IF(AND($B21=\"Y\",$C21=\"Y\",$G21=\"Y\",R21=R$3),1,\"\"))","v":""},{"$f":"IF(S$3=\"\",\"\",IF(AND($B21=\"Y\",$C21=\"Y\",$G21=\"Y\",S21=S$3),1,\"\"))","v":""},{"$f":"IF(T$3=\"\",\"\",IF(AND($B21=\"Y\",$C21=\"Y\",$G21=\"Y\",T21=T$3),1,\"\"))","v":""},{"$f":"IF(U$3=\"\",\"\",IF(AND($B21=\"Y\",$C21=\"Y\",$G21=\"Y\",U21=U$3),1,\"\"))","v":""},{"$f":"IF(V$3=\"\",\"\",IF(AND($B21=\"Y\",$C21=\"Y\",$G21=\"Y\",V21=V$3),1,\"\"))","v":""},{"$f":"IF(W$3=\"\",\"\",IF(AND($B21=\"Y\",$C21=\"Y\",$G21=\"Y\",W21=W$3),1,\"\"))","v":""},{"$f":"IF(X$3=\"\",\"\",IF(AND($B21=\"Y\",$C21=\"Y\",$G21=\"Y\",X21=X$3),1,\"\"))","v":""},{"$f":"IF(Y$3=\"\",\"\",IF(AND($B21=\"Y\",$C21=\"Y\",$G21=\"Y\",Y21=Y$3),1,\"\"))","v":""},{"$f":"IF(B21<>\"Y\",\"\",IF(Z21=\"\",\"\",Z21*$E$3))","v":""},null,"8B",null,"#10 - 9:33"]
[17,{"$nulls":24},{"$f":"IF(SUM(AB22:AS22)=0,\"\",SUM(AB22:AS22))","v":""},null,{"$f":"IF(H$3=\"\",\"\",IF(AND($B22=\"Y\",$C22=\"Y\",$G22=\"Y\",H22=H$3),1,\"\"))","v":""},{"$f":"IF(I$3=\"\",\"\",IF(AND($B22=\"Y\",$C22=\"Y\",$G22=\"Y\",I22=I$3),1,\"\"))","v":""},{"$f":"IF(J$3=\"\",\"\",IF(AND($B22=\"Y\",$C22=\"Y\",$G22=\"Y\",J22=J$3),1,\"\"))","v":""},{"$f":"IF(K$3=\"\",\"\",IF(AND($B22=\"Y\",$C22=\"Y\",$G22=\"Y\",K22=K$3),1,\"\"))","v":""},{"$f":"IF(L$3=\"\",\"\",IF(AND($B22=\"Y\",$C22=\"Y\",$G22=\"Y\",L22=L$3),1,\"\"))","v":""},{"$f":"IF(M$3=\"\",\"\",IF(AND($B22=\"Y\",$C22=\"Y\",$G22=\"Y\",M22=M$3),1,\"\"))","v":""},{"$f":"IF(N$3=\"\",\"\",IF(AND($B22=\"Y\",$C22=\"Y\",$G22=\"Y\",N22=N$3),1,\"\"))","v":""},{"$f":"IF(O$3=\"\",\"\",IF(AND($B22=\"Y\",$C22=\"Y\",$G22=\"Y\",O22=O$3),1,\"\"))","v":""},{"$f":"IF(P$3=\"\",\"\",IF(AND($B22=\"Y\",$C22=\"Y\",$G22=\"Y\",P22=P$3),1,\"\"))","v":""},{"$f":"IF(Q$3=\"\",\"\",IF(AND($B22=\"Y\",$C22=\"Y\",$G22=\"Y\",Q22=Q$3),1,\"\"))","v":""},{"$f":"IF(R$3=\"\",\"\",IF(AND($B22=\"Y\",$C22=\"Y\",$G22=\"Y\",R22=R$3),1,\"\"))","v":""},{"$f":"IF(S$3=\"\",\"\",IF(AND($B22=\"Y\",$C22=\"Y\",$G22=\"Y\",S22=S$3),1,\"\"))","v":""},{"$f":"IF(T$3=\"\",\"\",IF(AND($B22=\"Y\",$C22=\"Y\",$G22=\"Y\",T22=T$3),1,\"\"))","v":""},{"$f":"IF(U$3=\"\",\"\",IF(AND($B22=\"Y\",$C22=\"Y\",$G22=\"Y\",U22=U$3),1,\"\"))","v":""},{"$f":"IF(V$3=\"\",\"\",IF(AND($B22=\"Y\",$C22=\"Y\",$G22=\"Y\",V22=V$3),1,\"\"))","v":""},{"$f":"IF(W$3=\"\",\"\",IF(AND($B22=\"Y\",$C22=\"Y\",$G22=\"Y\",W22=W$3),1,\"\"))","v":""},{"$f":"IF(X$3=\"\",\"\",IF(AND($B22=\"Y\",$C22=\"Y\",$G22=\"Y\",X22=X$3),1,\"\"))","v":""},{"$f":"IF(Y$3=\"\",\"\",IF(AND($B22=\"Y\",$C22=\"Y\",$G22=\"Y\",Y22=Y$3),1,\"\"))","v":""},{"$f":"IF(B22<>\"Y\",\"\",IF(Z22=\"\",\"\",Z22*$E$3))","v":""},null,"9A",null,"#1 - 9:42"]
[18,{"$nulls":24},{"$f":"IF(SUM(AB23:AS23)=0,\"\",SUM(AB23:AS23))","v":""},null,{"$f":"IF(H$3=\"\",\"\",IF(AND($B23=\"Y\",$C23=\"Y\",$G23=\"Y\",H23=H$3),1,\"\"))","v":""},{"$f":"IF(I$3=\"\",\"\",IF(AND($B23=\"Y\",$C23=\"Y\",$G23=\"Y\",I23=I$3),1,\"\"))","v":""},{"$f":"IF(J$3=\"\",\"\",IF(AND($B23=\"Y\",$C23=\"Y\",$G23=\"Y\",J23=J$3),1,\"\"))","v":""},{"$f":"IF(K$3=\"\",\"\",IF(AND($B23=\"Y\",$C23=\"Y\",$G23=\"Y\",K23=K$3),1,\"\"))","v":""},{"$f":"IF(L$3=\"\",\"\",IF(AND($B23=\"Y\",$C23=\"Y\",$G23=\"Y\",L23=L$3),1,\"\"))","v":""},{"$f":"IF(M$3=\"\",\"\",IF(AND($B23=\"Y\",$C23=\"Y\",$G23=\"Y\",M23=M$3),1,\"\"))","v":""},{"$f":"IF(N$3=\"\",\"\",IF(AND($B23=\"Y\",$C23=\"Y\",$G23=\"Y\",N23=N$3),1,\"\"))","v":""},{"$f":"IF(O$3=\"\",\"\",IF(AND($B23=\"Y\",$C23=\"Y\",$G23=\"Y\",O23=O$3),1,\"\"))","v":""},{"$f":"IF(P$3=\"\",\"\",IF(AND($B23=\"Y\",$C23=\"Y\",$G23=\"Y\",P23=P$3),1,\"\"))","v":""},{"$f":"IF(Q$3=\"\",\"\",IF(AND($B23=\"Y\",$C23=\"Y\",$G23=\"Y\",Q23=Q$3),1,\"\"))","v":""},{"$f":"IF(R$3=\"\",\"\",IF(AND($B23=\"Y\",$C23=\"Y\",$G23=\"Y\",R23=R$3),1,\"\"))","v":""},{"$f":"IF(S$3=\"\",\"\",IF(AND($B23=\"Y\",$C23=\"Y\",$G23=\"Y\",S23=S$3),1,\"\"))","v":""},{"$f":"IF(T$3=\"\",\"\",IF(AND($B23=\"Y\",$C23=\"Y\",$G23=\"Y\",T23=T$3),1,\"\"))","v":""},{"$f":"IF(U$3=\"\",\"\",IF(AND($B23=\"Y\",$C23=\"Y\",$G23=\"Y\",U23=U$3),1,\"\"))","v":""},{"$f":"IF(V$3=\"\",\"\",IF(AND($B23=\"Y\",$C23=\"Y\",$G23=\"Y\",V23=V$3),1,\"\"))","v":""},{"$f":"IF(W$3=\"\",\"\",IF(AND($B23=\"Y\",$C23=\"Y\",$G23=\"Y\",W23=W$3),1,\"\"))","v":""},{"$f":"IF(X$3=\"\",\"\",IF(AND($B23=\"Y\",$C23=\"Y\",$G23=\"Y\",X23=X$3),1,\"\"))","v":""},{"$f":"IF(Y$3=\"\",\"\",IF(AND($B23=\"Y\",$C23=\"Y\",$G23=\"Y\",Y23=Y$3),1,\"\"))","v":""},{"$f":"IF(B23<>\"Y\",\"\",IF(Z23=\"\",\"\",Z23*$E$3))","v":""},null,"9B",null,"#10 - 9:42"]
[19,{"$nulls":24},{"$f":"IF(SUM(AB24:AS24)=0,\"\",SUM(AB24:AS24))","v":""},null,{"$f":"IF(H$3=\"\",\"\",IF(AND($B24=\"Y\",$C24=\"Y\",$G24=\"Y\",H24=H$3),1,\"\"))","v":""},{"$f":"IF(I$3=\"\",\"\",IF(AND($B24=\"Y\",$C24=\"Y\",$G24=\"Y\",I24=I$3),1,\"\"))","v":""},{"$f":"IF(J$3=\"\",\"\",IF(AND($B24=\"Y\",$C24=\"Y\",$G24=\"Y\",J24=J$3),1,\"\"))","v":""},{"$f":"IF(K$3=\"\",\"\",IF(AND($B24=\"Y\",$C24=\"Y\",$G24=\"Y\",K24=K$3),1,\"\"))","v":""},{"$f":"IF(L$3=\"\",\"\",IF(AND($B24=\"Y\",$C24=\"Y\",$G24=\"Y\",L24=L$3),1,\"\"))","v":""},{"$f":"IF(M$3=\"\",\"\",IF(AND($B24=\"Y\",$C24=\"Y\",$G24=\"Y\",M24=M$3),1,\"\"))","v":""},{"$f":"IF(N$3=\"\",\"\",IF(AND($B24=\"Y\",$C24=\"Y\",$G24=\"Y\",N24=N$3),1,\"\"))","v":""},{"$f":"IF(O$3=\"\",\"\",IF(AND($B24=\"Y\",$C24=\"Y\",$G24=\"Y\",O24=O$3),1,\"\"))","v":""},{"$f":"IF(P$3=\"\",\"\",IF(AND($B24=\"Y\",$C24=\"Y\",$G24=\"Y\",P24=P$3),1,\"\"))","v":""},{"$f":"IF(Q$3=\"\",\"\",IF(AND($B24=\"Y\",$C24=\"Y\",$G24=\"Y\",Q24=Q$3),1,\"\"))","v":""},{"$f":"IF(R$3=\"\",\"\",IF(AND($B24=\"Y\",$C24=\"Y\",$G24=\"Y\",R24=R$3),1,\"\"))","v":""},{"$f":"IF(S$3=\"\",\"\",IF(AND($B24=\"Y\",$C24=\"Y\",$G24=\"Y\",S24=S$3),1,\"\"))","v":""},{"$f":"IF(T$3=\"\",\"\",IF(AND($B24=\"Y\",$C24=\"Y\",$G24=\"Y\",T24=T$3),1,\"\"))","v":""},{"$f":"IF(U$3=\"\",\"\",IF(AND($B24=\"Y\",$C24=\"Y\",$G24=\"Y\",U24=U$3),1,\"\"))","v":""},{"$f":"IF(V$3=\"\",\"\",IF(AND($B24=\"Y\",$C24=\"Y\",$G24=\"Y\",V24=V$3),1,\"\"))","v":""},{"$f":"IF(W$3=\"\",\"\",IF(AND($B24=\"Y\",$C24=\"Y\",$G24=\"Y\",W24=W$3),1,\"\"))","v":""},{"$f":"IF(X$3=\"\",\"\",IF(AND($B24=\"Y\",$C24=\"Y\",$G24=\"Y\",X24=X$3),1,\"\"))","v":""},{"$f":"IF(Y$3=\"\",\"\",IF(AND($B24=\"Y\",$C24=\"Y\",$G24=\"Y\",Y24=Y$3),1,\"\"))","v":""},{"$f":"IF(B24<>\"Y\",\"\",IF(Z24=\"\",\"\",Z24*$E$3))","v":""},null,"10A",null,"#1 - 9:51"]
[20,{"$nulls":24},{"$f":"IF(SUM(AB25:AS25)=0,\"\",SUM(AB25:AS25))","v":""},null,{"$f":"IF(H$3=\"\",\"\",IF(AND($B25=\"Y\",$C25=\"Y\",$G25=\"Y\",H25=H$3),1,\"\"))","v":""},{"$f":"IF(I$3=\"\",\"\",IF(AND($B25=\"Y\",$C25=\"Y\",$G25=\"Y\",I25=I$3),1,\"\"))","v":""},{"$f":"IF(J$3=\"\",\"\",IF(AND($B25=\"Y\",$C25=\"Y\",$G25=\"Y\",J25=J$3),1,\"\"))","v":""},{"$f":"IF(K$3=\"\",\"\",IF(AND($B25=\"Y\",$C25=\"Y\",$G25=\"Y\",K25=K$3),1,\"\"))","v":""},{"$f":"IF(L$3=\"\",\"\",IF(AND($B25=\"Y\",$C25=\"Y\",$G25=\"Y\",L25=L$3),1,\"\"))","v":""},{"$f":"IF(M$3=\"\",\"\",IF(AND($B25=\"Y\",$C25=\"Y\",$G25=\"Y\",M25=M$3),1,\"\"))","v":""},{"$f":"IF(N$3=\"\",\"\",IF(AND($B25=\"Y\",$C25=\"Y\",$G25=\"Y\",N25=N$3),1,\"\"))","v":""},{"$f":"IF(O$3=\"\",\"\",IF(AND($B25=\"Y\",$C25=\"Y\",$G25=\"Y\",O25=O$3),1,\"\"))","v":""},{"$f":"IF(P$3=\"\",\"\",IF(AND($B25=\"Y\",$C25=\"Y\",$G25=\"Y\",P25=P$3),1,\"\"))","v":""},{"$f":"IF(Q$3=\"\",\"\",IF(AND($B25=\"Y\",$C25=\"Y\",$G25=\"Y\",Q25=Q$3),1,\"\"))","v":""},{"$f":"IF(R$3=\"\",\"\",IF(AND($B25=\"Y\",$C25=\"Y\",$G25=\"Y\",R25=R$3),1,\"\"))","v":""},{"$f":"IF(S$3=\"\",\"\",IF(AND($B25=\"Y\",$C25=\"Y\",$G25=\"Y\",S25=S$3),1,\"\"))","v":""},{"$f":"IF(T$3=\"\",\"\",IF(AND($B25=\"Y\",$C25=\"Y\",$G25=\"Y\",T25=T$3),1,\"\"))","v":""},{"$f":"IF(U$3=\"\",\"\",IF(AND($B25=\"Y\",$C25=\"Y\",$G25=\"Y\",U25=U$3),1,\"\"))","v":""},{"$f":"IF(V$3=\"\",\"\",IF(AND($B25=\"Y\",$C25=\"Y\",$G25=\"Y\",V25=V$3),1,\"\"))","v":""},{"$f":"IF(W$3=\"\",\"\",IF(AND($B25=\"Y\",$C25=\"Y\",$G25=\"Y\",W25=W$3),1,\"\"))","v":""},{"$f":"IF(X$3=\"\",\"\",IF(AND($B25=\"Y\",$C25=\"Y\",$G25=\"Y\",X25=X$3),1,\"\"))","v":""},{"$f":"IF(Y$3=\"\",\"\",IF(AND($B25=\"Y\",$C25=\"Y\",$G25=\"Y\",Y25=Y$3),1,\"\"))","v":""},{"$f":"IF(B25<>\"Y\",\"\",IF(Z25=\"\",\"\",Z25*$E$3))","v":""},null,"10B",null,"#10 - 9:51"]
[21,{"$nulls":24},{"$f":"IF(SUM(AB26:AS26)=0,\"\",SUM(AB26:AS26))","v":""},null,{"$f":"IF(H$3=\"\",\"\",IF(AND($B26=\"Y\",$C26=\"Y\",$G26=\"Y\",H26=H$3),1,\"\"))","v":""},{"$f":"IF(I$3=\"\",\"\",IF(AND($B26=\"Y\",$C26=\"Y\",$G26=\"Y\",I26=I$3),1,\"\"))","v":""},{"$f":"IF(J$3=\"\",\"\",IF(AND($B26=\"Y\",$C26=\"Y\",$G26=\"Y\",J26=J$3),1,\"\"))","v":""},{"$f":"IF(K$3=\"\",\"\",IF(AND($B26=\"Y\",$C26=\"Y\",$G26=\"Y\",K26=K$3),1,\"\"))","v":""},{"$f":"IF(L$3=\"\",\"\",IF(AND($B26=\"Y\",$C26=\"Y\",$G26=\"Y\",L26=L$3),1,\"\"))","v":""},{"$f":"IF(M$3=\"\",\"\",IF(AND($B26=\"Y\",$C26=\"Y\",$G26=\"Y\",M26=M$3),1,\"\"))","v":""},{"$f":"IF(N$3=\"\",\"\",IF(AND($B26=\"Y\",$C26=\"Y\",$G26=\"Y\",N26=N$3),1,\"\"))","v":""},{"$f":"IF(O$3=\"\",\"\",IF(AND($B26=\"Y\",$C26=\"Y\",$G26=\"Y\",O26=O$3),1,\"\"))","v":""},{"$f":"IF(P$3=\"\",\"\",IF(AND($B26=\"Y\",$C26=\"Y\",$G26=\"Y\",P26=P$3),1,\"\"))","v":""},{"$f":"IF(Q$3=\"\",\"\",IF(AND($B26=\"Y\",$C26=\"Y\",$G26=\"Y\",Q26=Q$3),1,\"\"))","v":""},{"$f":"IF(R$3=\"\",\"\",IF(AND($B26=\"Y\",$C26=\"Y\",$G26=\"Y\",R26=R$3),1,\"\"))","v":""},{"$f":"IF(S$3=\"\",\"\",IF(AND($B26=\"Y\",$C26=\"Y\",$G26=\"Y\",S26=S$3),1,\"\"))","v":""},{"$f":"IF(T$3=\"\",\"\",IF(AND($B26=\"Y\",$C26=\"Y\",$G26=\"Y\",T26=T$3),1,\"\"))","v":""},{"$f":"IF(U$3=\"\",\"\",IF(AND($B26=\"Y\",$C26=\"Y\",$G26=\"Y\",U26=U$3),1,\"\"))","v":""},{"$f":"IF(V$3=\"\",\"\",IF(AND($B26=\"Y\",$C26=\"Y\",$G26=\"Y\",V26=V$3),1,\"\"))","v":""},{"$f":"IF(W$3=\"\",\"\",IF(AND($B26=\"Y\",$C26=\"Y\",$G26=\"Y\",W26=W$3),1,\"\"))","v":""},{"$f":"IF(X$3=\"\",\"\",IF(AND($B26=\"Y\",$C26=\"Y\",$G26=\"Y\",X26=X$3),1,\"\"))","v":""},{"$f":"IF(Y$3=\"\",\"\",IF(AND($B26=\"Y\",$C26=\"Y\",$G26=\"Y\",Y26=Y$3),1,\"\"))","v":""},{"$f":"IF(B26<>\"Y\",\"\",IF(Z26=\"\",\"\",Z26*$E$3))","v":""},null,"11A",null,"#1 - 10:00"]
[22,{"$nulls":24},{"$f":"IF(SUM(AB27:AS27)=0,\"\",SUM(AB27:AS27))","v":""},null,{"$f":"IF(H$3=\"\",\"\",IF(AND($B27=\"Y\",$C27=\"Y\",$G27=\"Y\",H27=H$3),1,\"\"))","v":""},{"$f":"IF(I$3=\"\",\"\",IF(AND($B27=\"Y\",$C27=\"Y\",$G27=\"Y\",I27=I$3),1,\"\"))","v":""},{"$f":"IF(J$3=\"\",\"\",IF(AND($B27=\"Y\",$C27=\"Y\",$G27=\"Y\",J27=J$3),1,\"\"))","v":""},{"$f":"IF(K$3=\"\",\"\",IF(AND($B27=\"Y\",$C27=\"Y\",$G27=\"Y\",K27=K$3),1,\"\"))","v":""},{"$f":"IF(L$3=\"\",\"\",IF(AND($B27=\"Y\",$C27=\"Y\",$G27=\"Y\",L27=L$3),1,\"\"))","v":""},{"$f":"IF(M$3=\"\",\"\",IF(AND($B27=\"Y\",$C27=\"Y\",$G27=\"Y\",M27=M$3),1,\"\"))","v":""},{"$f":"IF(N$3=\"\",\"\",IF(AND($B27=\"Y\",$C27=\"Y\",$G27=\"Y\",N27=N$3),1,\"\"))","v":""},{"$f":"IF(O$3=\"\",\"\",IF(AND($B27=\"Y\",$C27=\"Y\",$G27=\"Y\",O27=O$3),1,\"\"))","v":""},{"$f":"IF(P$3=\"\",\"\",IF(AND($B27=\"Y\",$C27=\"Y\",$G27=\"Y\",P27=P$3),1,\"\"))","v":""},{"$f":"IF(Q$3=\"\",\"\",IF(AND($B27=\"Y\",$C27=\"Y\",$G27=\"Y\",Q27=Q$3),1,\"\"))","v":""},{"$f":"IF(R$3=\"\",\"\",IF(AND($B27=\"Y\",$C27=\"Y\",$G27=\"Y\",R27=R$3),1,\"\"))","v":""},{"$f":"IF(S$3=\"\",\"\",IF(AND($B27=\"Y\",$C27=\"Y\",$G27=\"Y\",S27=S$3),1,\"\"))","v":""},{"$f":"IF(T$3=\"\",\"\",IF(AND($B27=\"Y\",$C27=\"Y\",$G27=\"Y\",T27=T$3),1,\"\"))","v":""},{"$f":"IF(U$3=\"\",\"\",IF(AND($B27=\"Y\",$C27=\"Y\",$G27=\"Y\",U27=U$3),1,\"\"))","v":""},{"$f":"IF(V$3=\"\",\"\",IF(AND($B27=\"Y\",$C27=\"Y\",$G27=\"Y\",V27=V$3),1,\"\"))","v":""},{"$f":"IF(W$3=\"\",\"\",IF(AND($B27=\"Y\",$C27=\"Y\",$G27=\"Y\",W27=W$3),1,\"\"))","v":""},{"$f":"IF(X$3=\"\",\"\",IF(AND($B27=\"Y\",$C27=\"Y\",$G27=\"Y\",X27=X$3),1,\"\"))","v":""},{"$f":"IF(Y$3=\"\",\"\",IF(AND($B27=\"Y\",$C27=\"Y\",$G27=\"Y\",Y27=Y$3),1,\"\"))","v":""},{"$f":"IF(B27<>\"Y\",\"\",IF(Z27=\"\",\"\",Z27*$E$3))","v":""},null,"11B",null,"#10 - 10:00"]
[23,{"$nulls":24},{"$f":"IF(SUM(AB28:AS28)=0,\"\",SUM(AB28:AS28))","v":""},null,{"$f":"IF(H$3=\"\",\"\",IF(AND($B28=\"Y\",$C28=\"Y\",$G28=\"Y\",H28=H$3),1,\"\"))","v":""},{"$f":"IF(I$3=\"\",\"\",IF(AND($B28=\"Y\",$C28=\"Y\",$G28=\"Y\",I28=I$3),1,\"\"))","v":""},{"$f":"IF(J$3=\"\",\"\",IF(AND($B28=\"Y\",$C28=\"Y\",$G28=\"Y\",J28=J$3),1,\"\"))","v":""},{"$f":"IF(K$3=\"\",\"\",IF(AND($B28=\"Y\",$C28=\"Y\",$G28=\"Y\",K28=K$3),1,\"\"))","v":""},{"$f":"IF(L$3=\"\",\"\",IF(AND($B28=\"Y\",$C28=\"Y\",$G28=\"Y\",L28=L$3),1,\"\"))","v":""},{"$f":"IF(M$3=\"\",\"\",IF(AND($B28=\"Y\",$C28=\"Y\",$G28=\"Y\",M28=M$3),1,\"\"))","v":""},{"$f":"IF(N$3=\"\",\"\",IF(AND($B28=\"Y\",$C28=\"Y\",$G28=\"Y\",N28=N$3),1,\"\"))","v":""},{"$f":"IF(O$3=\"\",\"\",IF(AND($B28=\"Y\",$C28=\"Y\",$G28=\"Y\",O28=O$3),1,\"\"))","v":""},{"$f":"IF(P$3=\"\",\"\",IF(AND($B28=\"Y\",$C28=\"Y\",$G28=\"Y\",P28=P$3),1,\"\"))","v":""},{"$f":"IF(Q$3=\"\",\"\",IF(AND($B28=\"Y\",$C28=\"Y\",$G28=\"Y\",Q28=Q$3),1,\"\"))","v":""},{"$f":"IF(R$3=\"\",\"\",IF(AND($B28=\"Y\",$C28=\"Y\",$G28=\"Y\",R28=R$3),1,\"\"))","v":""},{"$f":"IF(S$3=\"\",\"\",IF(AND($B28=\"Y\",$C28=\"Y\",$G28=\"Y\",S28=S$3),1,\"\"))","v":""},{"$f":"IF(T$3=\"\",\"\",IF(AND($B28=\"Y\",$C28=\"Y\",$G28=\"Y\",T28=T$3),1,\"\"))","v":""},{"$f":"IF(U$3=\"\",\"\",IF(AND($B28=\"Y\",$C28=\"Y\",$G28=\"Y\",U28=U$3),1,\"\"))","v":""},{"$f":"IF(V$3=\"\",\"\",IF(AND($B28=\"Y\",$C28=\"Y\",$G28=\"Y\",V28=V$3),1,\"\"))","v":""},{"$f":"IF(W$3=\"\",\"\",IF(AND($B28=\"Y\",$C28=\"Y\",$G28=\"Y\",W28=W$3),1,\"\"))","v":""},{"$f":"IF(X$3=\"\",\"\",IF(AND($B28=\"Y\",$C28=\"Y\",$G28=\"Y\",X28=X$3),1,\"\"))","v":""},{"$f":"IF(Y$3=\"\",\"\",IF(AND($B28=\"Y\",$C28=\"Y\",$G28=\"Y\",Y28=Y$3),1,\"\"))","v":""},{"$f":"IF(B28<>\"Y\",\"\",IF(Z28=\"\",\"\",Z28*$E$3))","v":""},null,"12A",null,"#1 - 10:09"]
[24,{"$nulls":24},{"$f":"IF(SUM(AB29:AS29)=0,\"\",SUM(AB29:AS29))","v":""},null,{"$f":"IF(H$3=\"\",\"\",IF(AND($B29=\"Y\",$C29=\"Y\",$G29=\"Y\",H29=H$3),1,\"\"))","v":""},{"$f":"IF(I$3=\"\",\"\",IF(AND($B29=\"Y\",$C29=\"Y\",$G29=\"Y\",I29=I$3),1,\"\"))","v":""},{"$f":"IF(J$3=\"\",\"\",IF(AND($B29=\"Y\",$C29=\"Y\",$G29=\"Y\",J29=J$3),1,\"\"))","v":""},{"$f":"IF(K$3=\"\",\"\",IF(AND($B29=\"Y\",$C29=\"Y\",$G29=\"Y\",K29=K$3),1,\"\"))","v":""},{"$f":"IF(L$3=\"\",\"\",IF(AND($B29=\"Y\",$C29=\"Y\",$G29=\"Y\",L29=L$3),1,\"\"))","v":""},{"$f":"IF(M$3=\"\",\"\",IF(AND($B29=\"Y\",$C29=\"Y\",$G29=\"Y\",M29=M$3),1,\"\"))","v":""},{"$f":"IF(N$3=\"\",\"\",IF(AND($B29=\"Y\",$C29=\"Y\",$G29=\"Y\",N29=N$3),1,\"\"))","v":""},{"$f":"IF(O$3=\"\",\"\",IF(AND($B29=\"Y\",$C29=\"Y\",$G29=\"Y\",O29=O$3),1,\"\"))","v":""},{"$f":"IF(P$3=\"\",\"\",IF(AND($B29=\"Y\",$C29=\"Y\",$G29=\"Y\",P29=P$3),1,\"\"))","v":""},{"$f":"IF(Q$3=\"\",\"\",IF(AND($B29=\"Y\",$C29=\"Y\",$G29=\"Y\",Q29=Q$3),1,\"\"))","v":""},{"$f":"IF(R$3=\"\",\"\",IF(AND($B29=\"Y\",$C29=\"Y\",$G29=\"Y\",R29=R$3),1,\"\"))","v":""},{"$f":"IF(S$3=\"\",\"\",IF(AND($B29=\"Y\",$C29=\"Y\",$G29=\"Y\",S29=S$3),1,\"\"))","v":""},{"$f":"IF(T$3=\"\",\"\",IF(AND($B29=\"Y\",$C29=\"Y\",$G29=\"Y\",T29=T$3),1,\"\"))","v":""},{"$f":"IF(U$3=\"\",\"\",IF(AND($B29=\"Y\",$C29=\"Y\",$G29=\"Y\",U29=U$3),1,\"\"))","v":""},{"$f":"IF(V$3=\"\",\"\",IF(AND($B29=\"Y\",$C29=\"Y\",$G29=\"Y\",V29=V$3),1,\"\"))","v":""},{"$f":"IF(W$3=\"\",\"\",IF(AND($B29=\"Y\",$C29=\"Y\",$G29=\"Y\",W29=W$3),1,\"\"))","v":""},{"$f":"IF(X$3=\"\",\"\",IF(AND($B29=\"Y\",$C29=\"Y\",$G29=\"Y\",X29=X$3),1,\"\"))","v":""},{"$f":"IF(Y$3=\"\",\"\",IF(AND($B29=\"Y\",$C29=\"Y\",$G29=\"Y\",Y29=Y$3),1,\"\"))","v":""},{"$f":"IF(B29<>\"Y\",\"\",IF(Z29=\"\",\"\",Z29*$E$3))","v":""},null,"12B",null,"#10 - 10:09"]
[25,{"$nulls":24},{"$f":"IF(SUM(AB30:AS30)=0,\"\",SUM(AB30:AS30))","v":""},null,{"$f":"IF(H$3=\"\",\"\",IF(AND($B30=\"Y\",$C30=\"Y\",$G30=\"Y\",H30=H$3),1,\"\"))","v":""},{"$f":"IF(I$3=\"\",\"\",IF(AND($B30=\"Y\",$C30=\"Y\",$G30=\"Y\",I30=I$3),1,\"\"))","v":""},{"$f":"IF(J$3=\"\",\"\",IF(AND($B30=\"Y\",$C30=\"Y\",$G30=\"Y\",J30=J$3),1,\"\"))","v":""},{"$f":"IF(K$3=\"\",\"\",IF(AND($B30=\"Y\",$C30=\"Y\",$G30=\"Y\",K30=K$3),1,\"\"))","v":""},{"$f":"IF(L$3=\"\",\"\",IF(AND($B30=\"Y\",$C30=\"Y\",$G30=\"Y\",L30=L$3),1,\"\"))","v":""},{"$f":"IF(M$3=\"\",\"\",IF(AND($B30=\"Y\",$C30=\"Y\",$G30=\"Y\",M30=M$3),1,\"\"))","v":""},{"$f":"IF(N$3=\"\",\"\",IF(AND($B30=\"Y\",$C30=\"Y\",$G30=\"Y\",N30=N$3),1,\"\"))","v":""},{"$f":"IF(O$3=\"\",\"\",IF(AND($B30=\"Y\",$C30=\"Y\",$G30=\"Y\",O30=O$3),1,\"\"))","v":""},{"$f":"IF(P$3=\"\",\"\",IF(AND($B30=\"Y\",$C30=\"Y\",$G30=\"Y\",P30=P$3),1,\"\"))","v":""},{"$f":"IF(Q$3=\"\",\"\",IF(AND($B30=\"Y\",$C30=\"Y\",$G30=\"Y\",Q30=Q$3),1,\"\"))","v":""},{"$f":"IF(R$3=\"\",\"\",IF(AND($B30=\"Y\",$C30=\"Y\",$G30=\"Y\",R30=R$3),1,\"\"))","v":""},{"$f":"IF(S$3=\"\",\"\",IF(AND($B30=\"Y\",$C30=\"Y\",$G30=\"Y\",S30=S$3),1,\"\"))","v":""},{"$f":"IF(T$3=\"\",\"\",IF(AND($B30=\"Y\",$C30=\"Y\",$G30=\"Y\",T30=T$3),1,\"\"))","v":""},{"$f":"IF(U$3=\"\",\"\",IF(AND($B30=\"Y\",$C30=\"Y\",$G30=\"Y\",U30=U$3),1,\"\"))","v":""},{"$f":"IF(V$3=\"\",\"\",IF(AND($B30=\"Y\",$C30=\"Y\",$G30=\"Y\",V30=V$3),1,\"\"))","v":""},{"$f":"IF(W$3=\"\",\"\",IF(AND($B30=\"Y\",$C30=\"Y\",$G30=\"Y\",W30=W$3),1,\"\"))","v":""},{"$f":"IF(X$3=\"\",\"\",IF(AND($B30=\"Y\",$C30=\"Y\",$G30=\"Y\",X30=X$3),1,\"\"))","v":""},{"$f":"IF(Y$3=\"\",\"\",IF(AND($B30=\"Y\",$C30=\"Y\",$G30=\"Y\",Y30=Y$3),1,\"\"))","v":""},{"$f":"IF(B30<>\"Y\",\"\",IF(Z30=\"\",\"\",Z30*$E$3))","v":""},null,"13A",null,"#1 - 10:18"]
[26,{"$nulls":24},{"$f":"IF(SUM(AB31:AS31)=0,\"\",SUM(AB31:AS31))","v":""},null,{"$f":"IF(H$3=\"\",\"\",IF(AND($B31=\"Y\",$C31=\"Y\",$G31=\"Y\",H31=H$3),1,\"\"))","v":""},{"$f":"IF(I$3=\"\",\"\",IF(AND($B31=\"Y\",$C31=\"Y\",$G31=\"Y\",I31=I$3),1,\"\"))","v":""},{"$f":"IF(J$3=\"\",\"\",IF(AND($B31=\"Y\",$C31=\"Y\",$G31=\"Y\",J31=J$3),1,\"\"))","v":""},{"$f":"IF(K$3=\"\",\"\",IF(AND($B31=\"Y\",$C31=\"Y\",$G31=\"Y\",K31=K$3),1,\"\"))","v":""},{"$f":"IF(L$3=\"\",\"\",IF(AND($B31=\"Y\",$C31=\"Y\",$G31=\"Y\",L31=L$3),1,\"\"))","v":""},{"$f":"IF(M$3=\"\",\"\",IF(AND($B31=\"Y\",$C31=\"Y\",$G31=\"Y\",M31=M$3),1,\"\"))","v":""},{"$f":"IF(N$3=\"\",\"\",IF(AND($B31=\"Y\",$C31=\"Y\",$G31=\"Y\",N31=N$3),1,\"\"))","v":""},{"$f":"IF(O$3=\"\",\"\",IF(AND($B31=\"Y\",$C31=\"Y\",$G31=\"Y\",O31=O$3),1,\"\"))","v":""},{"$f":"IF(P$3=\"\",\"\",IF(AND($B31=\"Y\",$C31=\"Y\",$G31=\"Y\",P31=P$3),1,\"\"))","v":""},{"$f":"IF(Q$3=\"\",\"\",IF(AND($B31=\"Y\",$C31=\"Y\",$G31=\"Y\",Q31=Q$3),1,\"\"))","v":""},{"$f":"IF(R$3=\"\",\"\",IF(AND($B31=\"Y\",$C31=\"Y\",$G31=\"Y\",R31=R$3),1,\"\"))","v":""},{"$f":"IF(S$3=\"\",\"\",IF(AND($B31=\"Y\",$C31=\"Y\",$G31=\"Y\",S31=S$3),1,\"\"))","v":""},{"$f":"IF(T$3=\"\",\"\",IF(AND($B31=\"Y\",$C31=\"Y\",$G31=\"Y\",T31=T$3),1,\"\"))","v":""},{"$f":"IF(U$3=\"\",\"\",IF(AND($B31=\"Y\",$C31=\"Y\",$G31=\"Y\",U31=U$3),1,\"\"))","v":""},{"$f":"IF(V$3=\"\",\"\",IF(AND($B31=\"Y\",$C31=\"Y\",$G31=\"Y\",V31=V$3),1,\"\"))","v":""},{"$f":"IF(W$3=\"\",\"\",IF(AND($B31=\"Y\",$C31=\"Y\",$G31=\"Y\",W31=W$3),1,\"\"))","v":""},{"$f":"IF(X$3=\"\",\"\",IF(AND($B31=\"Y\",$C31=\"Y\",$G31=\"Y\",X31=X$3),1,\"\"))","v":""},{"$f":"IF(Y$3=\"\",\"\",IF(AND($B31=\"Y\",$C31=\"Y\",$G31=\"Y\",Y31=Y$3),1,\"\"))","v":""},{"$f":"IF(B31<>\"Y\",\"\",IF(Z31=\"\",\"\",Z31*$E$3))","v":""},null,"13B",null,"#10 - 10:18"]
[27,{"$nulls":24},{"$f":"IF(SUM(AB32:AS32)=0,\"\",SUM(AB32:AS32))","v":""},null,{"$f":"IF(H$3=\"\",\"\",IF(AND($B32=\"Y\",$C32=\"Y\",$G32=\"Y\",H32=H$3),1,\"\"))","v":""},{"$f":"IF(I$3=\"\",\"\",IF(AND($B32=\"Y\",$C32=\"Y\",$G32=\"Y\",I32=I$3),1,\"\"))","v":""},{"$f":"IF(J$3=\"\",\"\",IF(AND($B32=\"Y\",$C32=\"Y\",$G32=\"Y\",J32=J$3),1,\"\"))","v":""},{"$f":"IF(K$3=\"\",\"\",IF(AND($B32=\"Y\",$C32=\"Y\",$G32=\"Y\",K32=K$3),1,\"\"))","v":""},{"$f":"IF(L$3=\"\",\"\",IF(AND($B32=\"Y\",$C32=\"Y\",$G32=\"Y\",L32=L$3),1,\"\"))","v":""},{"$f":"IF(M$3=\"\",\"\",IF(AND($B32=\"Y\",$C32=\"Y\",$G32=\"Y\",M32=M$3),1,\"\"))","v":""},{"$f":"IF(N$3=\"\",\"\",IF(AND($B32=\"Y\",$C32=\"Y\",$G32=\"Y\",N32=N$3),1,\"\"))","v":""},{"$f":"IF(O$3=\"\",\"\",IF(AND($B32=\"Y\",$C32=\"Y\",$G32=\"Y\",O32=O$3),1,\"\"))","v":""},{"$f":"IF(P$3=\"\",\"\",IF(AND($B32=\"Y\",$C32=\"Y\",$G32=\"Y\",P32=P$3),1,\"\"))","v":""},{"$f":"IF(Q$3=\"\",\"\",IF(AND($B32=\"Y\",$C32=\"Y\",$G32=\"Y\",Q32=Q$3),1,\"\"))","v":""},{"$f":"IF(R$3=\"\",\"\",IF(AND($B32=\"Y\",$C32=\"Y\",$G32=\"Y\",R32=R$3),1,\"\"))","v":""},{"$f":"IF(S$3=\"\",\"\",IF(AND($B32=\"Y\",$C32=\"Y\",$G32=\"Y\",S32=S$3),1,\"\"))","v":""},{"$f":"IF(T$3=\"\",\"\",IF(AND($B32=\"Y\",$C32=\"Y\",$G32=\"Y\",T32=T$3),1,\"\"))","v":""},{"$f":"IF(U$3=\"\",\"\",IF(AND($B32=\"Y\",$C32=\"Y\",$G32=\"Y\",U32=U$3),1,\"\"))","v":""},{"$f":"IF(V$3=\"\",\"\",IF(AND($B32=\"Y\",$C32=\"Y\",$G32=\"Y\",V32=V$3),1,\"\"))","v":""},{"$f":"IF(W$3=\"\",\"\",IF(AND($B32=\"Y\",$C32=\"Y\",$G32=\"Y\",W32=W$3),1,\"\"))","v":""},{"$f":"IF(X$3=\"\",\"\",IF(AND($B32=\"Y\",$C32=\"Y\",$G32=\"Y\",X32=X$3),1,\"\"))","v":""},{"$f":"IF(Y$3=\"\",\"\",IF(AND($B32=\"Y\",$C32=\"Y\",$G32=\"Y\",Y32=Y$3),1,\"\"))","v":""},{"$f":"IF(B32<>\"Y\",\"\",IF(Z32=\"\",\"\",Z32*$E$3))","v":""},null,"14A",null,"#1 - 10:27"]
[28,{"$nulls":24},{"$f":"IF(SUM(AB33:AS33)=0,\"\",SUM(AB33:AS33))","v":""},null,{"$f":"IF(H$3=\"\",\"\",IF(AND($B33=\"Y\",$C33=\"Y\",$G33=\"Y\",H33=H$3),1,\"\"))","v":""},{"$f":"IF(I$3=\"\",\"\",IF(AND($B33=\"Y\",$C33=\"Y\",$G33=\"Y\",I33=I$3),1,\"\"))","v":""},{"$f":"IF(J$3=\"\",\"\",IF(AND($B33=\"Y\",$C33=\"Y\",$G33=\"Y\",J33=J$3),1,\"\"))","v":""},{"$f":"IF(K$3=\"\",\"\",IF(AND($B33=\"Y\",$C33=\"Y\",$G33=\"Y\",K33=K$3),1,\"\"))","v":""},{"$f":"IF(L$3=\"\",\"\",IF(AND($B33=\"Y\",$C33=\"Y\",$G33=\"Y\",L33=L$3),1,\"\"))","v":""},{"$f":"IF(M$3=\"\",\"\",IF(AND($B33=\"Y\",$C33=\"Y\",$G33=\"Y\",M33=M$3),1,\"\"))","v":""},{"$f":"IF(N$3=\"\",\"\",IF(AND($B33=\"Y\",$C33=\"Y\",$G33=\"Y\",N33=N$3),1,\"\"))","v":""},{"$f":"IF(O$3=\"\",\"\",IF(AND($B33=\"Y\",$C33=\"Y\",$G33=\"Y\",O33=O$3),1,\"\"))","v":""},{"$f":"IF(P$3=\"\",\"\",IF(AND($B33=\"Y\",$C33=\"Y\",$G33=\"Y\",P33=P$3),1,\"\"))","v":""},{"$f":"IF(Q$3=\"\",\"\",IF(AND($B33=\"Y\",$C33=\"Y\",$G33=\"Y\",Q33=Q$3),1,\"\"))","v":""},{"$f":"IF(R$3=\"\",\"\",IF(AND($B33=\"Y\",$C33=\"Y\",$G33=\"Y\",R33=R$3),1,\"\"))","v":""},{"$f":"IF(S$3=\"\",\"\",IF(AND($B33=\"Y\",$C33=\"Y\",$G33=\"Y\",S33=S$3),1,\"\"))","v":""},{"$f":"IF(T$3=\"\",\"\",IF(AND($B33=\"Y\",$C33=\"Y\",$G33=\"Y\",T33=T$3),1,\"\"))","v":""},{"$f":"IF(U$3=\"\",\"\",IF(AND($B33=\"Y\",$C33=\"Y\",$G33=\"Y\",U33=U$3),1,\"\"))","v":""},{"$f":"IF(V$3=\"\",\"\",IF(AND($B33=\"Y\",$C33=\"Y\",$G33=\"Y\",V33=V$3),1,\"\"))","v":""},{"$f":"IF(W$3=\"\",\"\",IF(AND($B33=\"Y\",$C33=\"Y\",$G33=\"Y\",W33=W$3),1,\"\"))","v":""},{"$f":"IF(X$3=\"\",\"\",IF(AND($B33=\"Y\",$C33=\"Y\",$G33=\"Y\",X33=X$3),1,\"\"))","v":""},{"$f":"IF(Y$3=\"\",\"\",IF(AND($B33=\"Y\",$C33=\"Y\",$G33=\"Y\",Y33=Y$3),1,\"\"))","v":""},{"$f":"IF(B33<>\"Y\",\"\",IF(Z33=\"\",\"\",Z33*$E$3))","v":""},null,"14B",null,"#10 - 10:27"]
[29,{"$nulls":24},{"$f":"IF(SUM(AB34:AS34)=0,\"\",SUM(AB34:AS34))","v":""},null,{"$f":"IF(H$3=\"\",\"\",IF(AND($B34=\"Y\",$C34=\"Y\",$G34=\"Y\",H34=H$3),1,\"\"))","v":""},{"$f":"IF(I$3=\"\",\"\",IF(AND($B34=\"Y\",$C34=\"Y\",$G34=\"Y\",I34=I$3),1,\"\"))","v":""},{"$f":"IF(J$3=\"\",\"\",IF(AND($B34=\"Y\",$C34=\"Y\",$G34=\"Y\",J34=J$3),1,\"\"))","v":""},{"$f":"IF(K$3=\"\",\"\",IF(AND($B34=\"Y\",$C34=\"Y\",$G34=\"Y\",K34=K$3),1,\"\"))","v":""},{"$f":"IF(L$3=\"\",\"\",IF(AND($B34=\"Y\",$C34=\"Y\",$G34=\"Y\",L34=L$3),1,\"\"))","v":""},{"$f":"IF(M$3=\"\",\"\",IF(AND($B34=\"Y\",$C34=\"Y\",$G34=\"Y\",M34=M$3),1,\"\"))","v":""},{"$f":"IF(N$3=\"\",\"\",IF(AND($B34=\"Y\",$C34=\"Y\",$G34=\"Y\",N34=N$3),1,\"\"))","v":""},{"$f":"IF(O$3=\"\",\"\",IF(AND($B34=\"Y\",$C34=\"Y\",$G34=\"Y\",O34=O$3),1,\"\"))","v":""},{"$f":"IF(P$3=\"\",\"\",IF(AND($B34=\"Y\",$C34=\"Y\",$G34=\"Y\",P34=P$3),1,\"\"))","v":""},{"$f":"IF(Q$3=\"\",\"\",IF(AND($B34=\"Y\",$C34=\"Y\",$G34=\"Y\",Q34=Q$3),1,\"\"))","v":""},{"$f":"IF(R$3=\"\",\"\",IF(AND($B34=\"Y\",$C34=\"Y\",$G34=\"Y\",R34=R$3),1,\"\"))","v":""},{"$f":"IF(S$3=\"\",\"\",IF(AND($B34=\"Y\",$C34=\"Y\",$G34=\"Y\",S34=S$3),1,\"\"))","v":""},{"$f":"IF(T$3=\"\",\"\",IF(AND($B34=\"Y\",$C34=\"Y\",$G34=\"Y\",T34=T$3),1,\"\"))","v":""},{"$f":"IF(U$3=\"\",\"\",IF(AND($B34=\"Y\",$C34=\"Y\",$G34=\"Y\",U34=U$3),1,\"\"))","v":""},{"$f":"IF(V$3=\"\",\"\",IF(AND($B34=\"Y\",$C34=\"Y\",$G34=\"Y\",V34=V$3),1,\"\"))","v":""},{"$f":"IF(W$3=\"\",\"\",IF(AND($B34=\"Y\",$C34=\"Y\",$G34=\"Y\",W34=W$3),1,\"\"))","v":""},{"$f":"IF(X$3=\"\",\"\",IF(AND($B34=\"Y\",$C34=\"Y\",$G34=\"Y\",X34=X$3),1,\"\"))","v":""},{"$f":"IF(Y$3=\"\",\"\",IF(AND($B34=\"Y\",$C34=\"Y\",$G34=\"Y\",Y34=Y$3),1,\"\"))","v":""},{"$f":"IF(B34<>\"Y\",\"\",IF(Z34=\"\",\"\",Z34*$E$3))","v":""},null,"15A"]
[30,{"$nulls":24},{"$f":"IF(SUM(AB35:AS35)=0,\"\",SUM(AB35:AS35))","v":""},null,{"$f":"IF(H$3=\"\",\"\",IF(AND($B35=\"Y\",$C35=\"Y\",$G35=\"Y\",H35=H$3),1,\"\"))","v":""},{"$f":"IF(I$3=\"\",\"\",IF(AND($B35=\"Y\",$C35=\"Y\",$G35=\"Y\",I35=I$3),1,\"\"))","v":""},{"$f":"IF(J$3=\"\",\"\",IF(AND($B35=\"Y\",$C35=\"Y\",$G35=\"Y\",J35=J$3),1,\"\"))","v":""},{"$f":"IF(K$3=\"\",\"\",IF(AND($B35=\"Y\",$C35=\"Y\",$G35=\"Y\",K35=K$3),1,\"\"))","v":""},{"$f":"IF(L$3=\"\",\"\",IF(AND($B35=\"Y\",$C35=\"Y\",$G35=\"Y\",L35=L$3),1,\"\"))","v":""},{"$f":"IF(M$3=\"\",\"\",IF(AND($B35=\"Y\",$C35=\"Y\",$G35=\"Y\",M35=M$3),1,\"\"))","v":""},{"$f":"IF(N$3=\"\",\"\",IF(AND($B35=\"Y\",$C35=\"Y\",$G35=\"Y\",N35=N$3),1,\"\"))","v":""},{"$f":"IF(O$3=\"\",\"\",IF(AND($B35=\"Y\",$C35=\"Y\",$G35=\"Y\",O35=O$3),1,\"\"))","v":""},{"$f":"IF(P$3=\"\",\"\",IF(AND($B35=\"Y\",$C35=\"Y\",$G35=\"Y\",P35=P$3),1,\"\"))","v":""},{"$f":"IF(Q$3=\"\",\"\",IF(AND($B35=\"Y\",$C35=\"Y\",$G35=\"Y\",Q35=Q$3),1,\"\"))","v":""},{"$f":"IF(R$3=\"\",\"\",IF(AND($B35=\"Y\",$C35=\"Y\",$G35=\"Y\",R35=R$3),1,\"\"))","v":""},{"$f":"IF(S$3=\"\",\"\",IF(AND($B35=\"Y\",$C35=\"Y\",$G35=\"Y\",S35=S$3),1,\"\"))","v":""},{"$f":"IF(T$3=\"\",\"\",IF(AND($B35=\"Y\",$C35=\"Y\",$G35=\"Y\",T35=T$3),1,\"\"))","v":""},{"$f":"IF(U$3=\"\",\"\",IF(AND($B35=\"Y\",$C35=\"Y\",$G35=\"Y\",U35=U$3),1,\"\"))","v":""},{"$f":"IF(V$3=\"\",\"\",IF(AND($B35=\"Y\",$C35=\"Y\",$G35=\"Y\",V35=V$3),1,\"\"))","v":""},{"$f":"IF(W$3=\"\",\"\",IF(AND($B35=\"Y\",$C35=\"Y\",$G35=\"Y\",W35=W$3),1,\"\"))","v":""},{"$f":"IF(X$3=\"\",\"\",IF(AND($B35=\"Y\",$C35=\"Y\",$G35=\"Y\",X35=X$3),1,\"\"))","v":""},{"$f":"IF(Y$3=\"\",\"\",IF(AND($B35=\"Y\",$C35=\"Y\",$G35=\"Y\",Y35=Y$3),1,\"\"))","v":""},{"$f":"IF(B35<>\"Y\",\"\",IF(Z35=\"\",\"\",Z35*$E$3))","v":""},null,"15B"]
[31,{"$nulls":24},{"$f":"IF(SUM(AB36:AS36)=0,\"\",SUM(AB36:AS36))","v":""},null,{"$f":"IF(H$3=\"\",\"\",IF(AND($B36=\"Y\",$C36=\"Y\",$G36=\"Y\",H36=H$3),1,\"\"))","v":""},{"$f":"IF(I$3=\"\",\"\",IF(AND($B36=\"Y\",$C36=\"Y\",$G36=\"Y\",I36=I$3),1,\"\"))","v":""},{"$f":"IF(J$3=\"\",\"\",IF(AND($B36=\"Y\",$C36=\"Y\",$G36=\"Y\",J36=J$3),1,\"\"))","v":""},{"$f":"IF(K$3=\"\",\"\",IF(AND($B36=\"Y\",$C36=\"Y\",$G36=\"Y\",K36=K$3),1,\"\"))","v":""},{"$f":"IF(L$3=\"\",\"\",IF(AND($B36=\"Y\",$C36=\"Y\",$G36=\"Y\",L36=L$3),1,\"\"))","v":""},{"$f":"IF(M$3=\"\",\"\",IF(AND($B36=\"Y\",$C36=\"Y\",$G36=\"Y\",M36=M$3),1,\"\"))","v":""},{"$f":"IF(N$3=\"\",\"\",IF(AND($B36=\"Y\",$C36=\"Y\",$G36=\"Y\",N36=N$3),1,\"\"))","v":""},{"$f":"IF(O$3=\"\",\"\",IF(AND($B36=\"Y\",$C36=\"Y\",$G36=\"Y\",O36=O$3),1,\"\"))","v":""},{"$f":"IF(P$3=\"\",\"\",IF(AND($B36=\"Y\",$C36=\"Y\",$G36=\"Y\",P36=P$3),1,\"\"))","v":""},{"$f":"IF(Q$3=\"\",\"\",IF(AND($B36=\"Y\",$C36=\"Y\",$G36=\"Y\",Q36=Q$3),1,\"\"))","v":""},{"$f":"IF(R$3=\"\",\"\",IF(AND($B36=\"Y\",$C36=\"Y\",$G36=\"Y\",R36=R$3),1,\"\"))","v":""},{"$f":"IF(S$3=\"\",\"\",IF(AND($B36=\"Y\",$C36=\"Y\",$G36=\"Y\",S36=S$3),1,\"\"))","v":""},{"$f":"IF(T$3=\"\",\"\",IF(AND($B36=\"Y\",$C36=\"Y\",$G36=\"Y\",T36=T$3),1,\"\"))","v":""},{"$f":"IF(U$3=\"\",\"\",IF(AND($B36=\"Y\",$C36=\"Y\",$G36=\"Y\",U36=U$3),1,\"\"))","v":""},{"$f":"IF(V$3=\"\",\"\",IF(AND($B36=\"Y\",$C36=\"Y\",$G36=\"Y\",V36=V$3),1,\"\"))","v":""},{"$f":"IF(W$3=\"\",\"\",IF(AND($B36=\"Y\",$C36=\"Y\",$G36=\"Y\",W36=W$3),1,\"\"))","v":""},{"$f":"IF(X$3=\"\",\"\",IF(AND($B36=\"Y\",$C36=\"Y\",$G36=\"Y\",X36=X$3),1,\"\"))","v":""},{"$f":"IF(Y$3=\"\",\"\",IF(AND($B36=\"Y\",$C36=\"Y\",$G36=\"Y\",Y36=Y$3),1,\"\"))","v":""},{"$f":"IF(B36<>\"Y\",\"\",IF(Z36=\"\",\"\",Z36*$E$3))","v":""},null,"16A"]
[32,{"$nulls":24},{"$f":"IF(SUM(AB37:AS37)=0,\"\",SUM(AB37:AS37))","v":""},null,{"$f":"IF(H$3=\"\",\"\",IF(AND($B37=\"Y\",$C37=\"Y\",$G37=\"Y\",H37=H$3),1,\"\"))","v":""},{"$f":"IF(I$3=\"\",\"\",IF(AND($B37=\"Y\",$C37=\"Y\",$G37=\"Y\",I37=I$3),1,\"\"))","v":""},{"$f":"IF(J$3=\"\",\"\",IF(AND($B37=\"Y\",$C37=\"Y\",$G37=\"Y\",J37=J$3),1,\"\"))","v":""},{"$f":"IF(K$3=\"\",\"\",IF(AND($B37=\"Y\",$C37=\"Y\",$G37=\"Y\",K37=K$3),1,\"\"))","v":""},{"$f":"IF(L$3=\"\",\"\",IF(AND($B37=\"Y\",$C37=\"Y\",$G37=\"Y\",L37=L$3),1,\"\"))","v":""},{"$f":"IF(M$3=\"\",\"\",IF(AND($B37=\"Y\",$C37=\"Y\",$G37=\"Y\",M37=M$3),1,\"\"))","v":""},{"$f":"IF(N$3=\"\",\"\",IF(AND($B37=\"Y\",$C37=\"Y\",$G37=\"Y\",N37=N$3),1,\"\"))","v":""},{"$f":"IF(O$3=\"\",\"\",IF(AND($B37=\"Y\",$C37=\"Y\",$G37=\"Y\",O37=O$3),1,\"\"))","v":""},{"$f":"IF(P$3=\"\",\"\",IF(AND($B37=\"Y\",$C37=\"Y\",$G37=\"Y\",P37=P$3),1,\"\"))","v":""},{"$f":"IF(Q$3=\"\",\"\",IF(AND($B37=\"Y\",$C37=\"Y\",$G37=\"Y\",Q37=Q$3),1,\"\"))","v":""},{"$f":"IF(R$3=\"\",\"\",IF(AND($B37=\"Y\",$C37=\"Y\",$G37=\"Y\",R37=R$3),1,\"\"))","v":""},{"$f":"IF(S$3=\"\",\"\",IF(AND($B37=\"Y\",$C37=\"Y\",$G37=\"Y\",S37=S$3),1,\"\"))","v":""},{"$f":"IF(T$3=\"\",\"\",IF(AND($B37=\"Y\",$C37=\"Y\",$G37=\"Y\",T37=T$3),1,\"\"))","v":""},{"$f":"IF(U$3=\"\",\"\",IF(AND($B37=\"Y\",$C37=\"Y\",$G37=\"Y\",U37=U$3),1,\"\"))","v":""},{"$f":"IF(V$3=\"\",\"\",IF(AND($B37=\"Y\",$C37=\"Y\",$G37=\"Y\",V37=V$3),1,\"\"))","v":""},{"$f":"IF(W$3=\"\",\"\",IF(AND($B37=\"Y\",$C37=\"Y\",$G37=\"Y\",W37=W$3),1,\"\"))","v":""},{"$f":"IF(X$3=\"\",\"\",IF(AND($B37=\"Y\",$C37=\"Y\",$G37=\"Y\",X37=X$3),1,\"\"))","v":""},{"$f":"IF(Y$3=\"\",\"\",IF(AND($B37=\"Y\",$C37=\"Y\",$G37=\"Y\",Y37=Y$3),1,\"\"))","v":""},{"$f":"IF(B37<>\"Y\",\"\",IF(Z37=\"\",\"\",Z37*$E$3))","v":""},null,"16B"]
[33,{"$nulls":24},{"$f":"IF(SUM(AB38:AS38)=0,\"\",SUM(AB38:AS38))","v":""},null,{"$f":"IF(H$3=\"\",\"\",IF(AND($B38=\"Y\",$C38=\"Y\",$G38=\"Y\",H38=H$3),1,\"\"))","v":""},{"$f":"IF(I$3=\"\",\"\",IF(AND($B38=\"Y\",$C38=\"Y\",$G38=\"Y\",I38=I$3),1,\"\"))","v":""},{"$f":"IF(J$3=\"\",\"\",IF(AND($B38=\"Y\",$C38=\"Y\",$G38=\"Y\",J38=J$3),1,\"\"))","v":""},{"$f":"IF(K$3=\"\",\"\",IF(AND($B38=\"Y\",$C38=\"Y\",$G38=\"Y\",K38=K$3),1,\"\"))","v":""},{"$f":"IF(L$3=\"\",\"\",IF(AND($B38=\"Y\",$C38=\"Y\",$G38=\"Y\",L38=L$3),1,\"\"))","v":""},{"$f":"IF(M$3=\"\",\"\",IF(AND($B38=\"Y\",$C38=\"Y\",$G38=\"Y\",M38=M$3),1,\"\"))","v":""},{"$f":"IF(N$3=\"\",\"\",IF(AND($B38=\"Y\",$C38=\"Y\",$G38=\"Y\",N38=N$3),1,\"\"))","v":""},{"$f":"IF(O$3=\"\",\"\",IF(AND($B38=\"Y\",$C38=\"Y\",$G38=\"Y\",O38=O$3),1,\"\"))","v":""},{"$f":"IF(P$3=\"\",\"\",IF(AND($B38=\"Y\",$C38=\"Y\",$G38=\"Y\",P38=P$3),1,\"\"))","v":""},{"$f":"IF(Q$3=\"\",\"\",IF(AND($B38=\"Y\",$C38=\"Y\",$G38=\"Y\",Q38=Q$3),1,\"\"))","v":""},{"$f":"IF(R$3=\"\",\"\",IF(AND($B38=\"Y\",$C38=\"Y\",$G38=\"Y\",R38=R$3),1,\"\"))","v":""},{"$f":"IF(S$3=\"\",\"\",IF(AND($B38=\"Y\",$C38=\"Y\",$G38=\"Y\",S38=S$3),1,\"\"))","v":""},{"$f":"IF(T$3=\"\",\"\",IF(AND($B38=\"Y\",$C38=\"Y\",$G38=\"Y\",T38=T$3),1,\"\"))","v":""},{"$f":"IF(U$3=\"\",\"\",IF(AND($B38=\"Y\",$C38=\"Y\",$G38=\"Y\",U38=U$3),1,\"\"))","v":""},{"$f":"IF(V$3=\"\",\"\",IF(AND($B38=\"Y\",$C38=\"Y\",$G38=\"Y\",V38=V$3),1,\"\"))","v":""},{"$f":"IF(W$3=\"\",\"\",IF(AND($B38=\"Y\",$C38=\"Y\",$G38=\"Y\",W38=W$3),1,\"\"))","v":""},{"$f":"IF(X$3=\"\",\"\",IF(AND($B38=\"Y\",$C38=\"Y\",$G38=\"Y\",X38=X$3),1,\"\"))","v":""},{"$f":"IF(Y$3=\"\",\"\",IF(AND($B38=\"Y\",$C38=\"Y\",$G38=\"Y\",Y38=Y$3),1,\"\"))","v":""},{"$f":"IF(B38<>\"Y\",\"\",IF(Z38=\"\",\"\",Z38*$E$3))","v":""},null,"17A"]
[34,{"$nulls":24},{"$f":"IF(SUM(AB39:AS39)=0,\"\",SUM(AB39:AS39))","v":""},null,{"$f":"IF(H$3=\"\",\"\",IF(AND($B39=\"Y\",$C39=\"Y\",$G39=\"Y\",H39=H$3),1,\"\"))","v":""},{"$f":"IF(I$3=\"\",\"\",IF(AND($B39=\"Y\",$C39=\"Y\",$G39=\"Y\",I39=I$3),1,\"\"))","v":""},{"$f":"IF(J$3=\"\",\"\",IF(AND($B39=\"Y\",$C39=\"Y\",$G39=\"Y\",J39=J$3),1,\"\"))","v":""},{"$f":"IF(K$3=\"\",\"\",IF(AND($B39=\"Y\",$C39=\"Y\",$G39=\"Y\",K39=K$3),1,\"\"))","v":""},{"$f":"IF(L$3=\"\",\"\",IF(AND($B39=\"Y\",$C39=\"Y\",$G39=\"Y\",L39=L$3),1,\"\"))","v":""},{"$f":"IF(M$3=\"\",\"\",IF(AND($B39=\"Y\",$C39=\"Y\",$G39=\"Y\",M39=M$3),1,\"\"))","v":""},{"$f":"IF(N$3=\"\",\"\",IF(AND($B39=\"Y\",$C39=\"Y\",$G39=\"Y\",N39=N$3),1,\"\"))","v":""},{"$f":"IF(O$3=\"\",\"\",IF(AND($B39=\"Y\",$C39=\"Y\",$G39=\"Y\",O39=O$3),1,\"\"))","v":""},{"$f":"IF(P$3=\"\",\"\",IF(AND($B39=\"Y\",$C39=\"Y\",$G39=\"Y\",P39=P$3),1,\"\"))","v":""},{"$f":"IF(Q$3=\"\",\"\",IF(AND($B39=\"Y\",$C39=\"Y\",$G39=\"Y\",Q39=Q$3),1,\"\"))","v":""},{"$f":"IF(R$3=\"\",\"\",IF(AND($B39=\"Y\",$C39=\"Y\",$G39=\"Y\",R39=R$3),1,\"\"))","v":""},{"$f":"IF(S$3=\"\",\"\",IF(AND($B39=\"Y\",$C39=\"Y\",$G39=\"Y\",S39=S$3),1,\"\"))","v":""},{"$f":"IF(T$3=\"\",\"\",IF(AND($B39=\"Y\",$C39=\"Y\",$G39=\"Y\",T39=T$3),1,\"\"))","v":""},{"$f":"IF(U$3=\"\",\"\",IF(AND($B39=\"Y\",$C39=\"Y\",$G39=\"Y\",U39=U$3),1,\"\"))","v":""},{"$f":"IF(V$3=\"\",\"\",IF(AND($B39=\"Y\",$C39=\"Y\",$G39=\"Y\",V39=V$3),1,\"\"))","v":""},{"$f":"IF(W$3=\"\",\"\",IF(AND($B39=\"Y\",$C39=\"Y\",$G39=\"Y\",W39=W$3),1,\"\"))","v":""},{"$f":"IF(X$3=\"\",\"\",IF(AND($B39=\"Y\",$C39=\"Y\",$G39=\"Y\",X39=X$3),1,\"\"))","v":""},{"$f":"IF(Y$3=\"\",\"\",IF(AND($B39=\"Y\",$C39=\"Y\",$G39=\"Y\",Y39=Y$3),1,\"\"))","v":""},{"$f":"IF(B39<>\"Y\",\"\",IF(Z39=\"\",\"\",Z39*$E$3))","v":""},null,"17B"]
[35,{"$nulls":24},{"$f":"IF(SUM(AB40:AS40)=0,\"\",SUM(AB40:AS40))","v":""},null,{"$f":"IF(H$3=\"\",\"\",IF(AND($B40=\"Y\",$C40=\"Y\",$G40=\"Y\",H40=H$3),1,\"\"))","v":""},{"$f":"IF(I$3=\"\",\"\",IF(AND($B40=\"Y\",$C40=\"Y\",$G40=\"Y\",I40=I$3),1,\"\"))","v":""},{"$f":"IF(J$3=\"\",\"\",IF(AND($B40=\"Y\",$C40=\"Y\",$G40=\"Y\",J40=J$3),1,\"\"))","v":""},{"$f":"IF(K$3=\"\",\"\",IF(AND($B40=\"Y\",$C40=\"Y\",$G40=\"Y\",K40=K$3),1,\"\"))","v":""},{"$f":"IF(L$3=\"\",\"\",IF(AND($B40=\"Y\",$C40=\"Y\",$G40=\"Y\",L40=L$3),1,\"\"))","v":""},{"$f":"IF(M$3=\"\",\"\",IF(AND($B40=\"Y\",$C40=\"Y\",$G40=\"Y\",M40=M$3),1,\"\"))","v":""},{"$f":"IF(N$3=\"\",\"\",IF(AND($B40=\"Y\",$C40=\"Y\",$G40=\"Y\",N40=N$3),1,\"\"))","v":""},{"$f":"IF(O$3=\"\",\"\",IF(AND($B40=\"Y\",$C40=\"Y\",$G40=\"Y\",O40=O$3),1,\"\"))","v":""},{"$f":"IF(P$3=\"\",\"\",IF(AND($B40=\"Y\",$C40=\"Y\",$G40=\"Y\",P40=P$3),1,\"\"))","v":""},{"$f":"IF(Q$3=\"\",\"\",IF(AND($B40=\"Y\",$C40=\"Y\",$G40=\"Y\",Q40=Q$3),1,\"\"))","v":""},{"$f":"IF(R$3=\"\",\"\",IF(AND($B40=\"Y\",$C40=\"Y\",$G40=\"Y\",R40=R$3),1,\"\"))","v":""},{"$f":"IF(S$3=\"\",\"\",IF(AND($B40=\"Y\",$C40=\"Y\",$G40=\"Y\",S40=S$3),1,\"\"))","v":""},{"$f":"IF(T$3=\"\",\"\",IF(AND($B40=\"Y\",$C40=\"Y\",$G40=\"Y\",T40=T$3),1,\"\"))","v":""},{"$f":"IF(U$3=\"\",\"\",IF(AND($B40=\"Y\",$C40=\"Y\",$G40=\"Y\",U40=U$3),1,\"\"))","v":""},{"$f":"IF(V$3=\"\",\"\",IF(AND($B40=\"Y\",$C40=\"Y\",$G40=\"Y\",V40=V$3),1,\"\"))","v":""},{"$f":"IF(W$3=\"\",\"\",IF(AND($B40=\"Y\",$C40=\"Y\",$G40=\"Y\",W40=W$3),1,\"\"))","v":""},{"$f":"IF(X$3=\"\",\"\",IF(AND($B40=\"Y\",$C40=\"Y\",$G40=\"Y\",X40=X$3),1,\"\"))","v":""},{"$f":"IF(Y$3=\"\",\"\",IF(AND($B40=\"Y\",$C40=\"Y\",$G40=\"Y\",Y40=Y$3),1,\"\"))","v":""},{"$f":"IF(B40<>\"Y\",\"\",IF(Z40=\"\",\"\",Z40*$E$3))","v":""},null,"18A"]
[36,{"$nulls":24},{"$f":"IF(SUM(AB41:AS41)=0,\"\",SUM(AB41:AS41))","v":""},null,{"$f":"IF(H$3=\"\",\"\",IF(AND($B41=\"Y\",$C41=\"Y\",$G41=\"Y\",H41=H$3),1,\"\"))","v":""},{"$f":"IF(I$3=\"\",\"\",IF(AND($B41=\"Y\",$C41=\"Y\",$G41=\"Y\",I41=I$3),1,\"\"))","v":""},{"$f":"IF(J$3=\"\",\"\",IF(AND($B41=\"Y\",$C41=\"Y\",$G41=\"Y\",J41=J$3),1,\"\"))","v":""},{"$f":"IF(K$3=\"\",\"\",IF(AND($B41=\"Y\",$C41=\"Y\",$G41=\"Y\",K41=K$3),1,\"\"))","v":""},{"$f":"IF(L$3=\"\",\"\",IF(AND($B41=\"Y\",$C41=\"Y\",$G41=\"Y\",L41=L$3),1,\"\"))","v":""},{"$f":"IF(M$3=\"\",\"\",IF(AND($B41=\"Y\",$C41=\"Y\",$G41=\"Y\",M41=M$3),1,\"\"))","v":""},{"$f":"IF(N$3=\"\",\"\",IF(AND($B41=\"Y\",$C41=\"Y\",$G41=\"Y\",N41=N$3),1,\"\"))","v":""},{"$f":"IF(O$3=\"\",\"\",IF(AND($B41=\"Y\",$C41=\"Y\",$G41=\"Y\",O41=O$3),1,\"\"))","v":""},{"$f":"IF(P$3=\"\",\"\",IF(AND($B41=\"Y\",$C41=\"Y\",$G41=\"Y\",P41=P$3),1,\"\"))","v":""},{"$f":"IF(Q$3=\"\",\"\",IF(AND($B41=\"Y\",$C41=\"Y\",$G41=\"Y\",Q41=Q$3),1,\"\"))","v":""},{"$f":"IF(R$3=\"\",\"\",IF(AND($B41=\"Y\",$C41=\"Y\",$G41=\"Y\",R41=R$3),1,\"\"))","v":""},{"$f":"IF(S$3=\"\",\"\",IF(AND($B41=\"Y\",$C41=\"Y\",$G41=\"Y\",S41=S$3),1,\"\"))","v":""},{"$f":"IF(T$3=\"\",\"\",IF(AND($B41=\"Y\",$C41=\"Y\",$G41=\"Y\",T41=T$3),1,\"\"))","v":""},{"$f":"IF(U$3=\"\",\"\",IF(AND($B41=\"Y\",$C41=\"Y\",$G41=\"Y\",U41=U$3),1,\"\"))","v":""},{"$f":"IF(V$3=\"\",\"\",IF(AND($B41=\"Y\",$C41=\"Y\",$G41=\"Y\",V41=V$3),1,\"\"))","v":""},{"$f":"IF(W$3=\"\",\"\",IF(AND($B41=\"Y\",$C41=\"Y\",$G41=\"Y\",W41=W$3),1,\"\"))","v":""},{"$f":"IF(X$3=\"\",\"\",IF(AND($B41=\"Y\",$C41=\"Y\",$G41=\"Y\",X41=X$3),1,\"\"))","v":""},{"$f":"IF(Y$3=\"\",\"\",IF(AND($B41=\"Y\",$C41=\"Y\",$G41=\"Y\",Y41=Y$3),1,\"\"))","v":""},{"$f":"IF(B41<>\"Y\",\"\",IF(Z41=\"\",\"\",Z41*$E$3))","v":""},null,"18B"]
[37,{"$nulls":24},{"$f":"IF(SUM(AB42:AS42)=0,\"\",SUM(AB42:AS42))","v":""},null,{"$f":"IF(H$3=\"\",\"\",IF(AND($B42=\"Y\",$C42=\"Y\",$G42=\"Y\",H42=H$3),1,\"\"))","v":""},{"$f":"IF(I$3=\"\",\"\",IF(AND($B42=\"Y\",$C42=\"Y\",$G42=\"Y\",I42=I$3),1,\"\"))","v":""},{"$f":"IF(J$3=\"\",\"\",IF(AND($B42=\"Y\",$C42=\"Y\",$G42=\"Y\",J42=J$3),1,\"\"))","v":""},{"$f":"IF(K$3=\"\",\"\",IF(AND($B42=\"Y\",$C42=\"Y\",$G42=\"Y\",K42=K$3),1,\"\"))","v":""},{"$f":"IF(L$3=\"\",\"\",IF(AND($B42=\"Y\",$C42=\"Y\",$G42=\"Y\",L42=L$3),1,\"\"))","v":""},{"$f":"IF(M$3=\"\",\"\",IF(AND($B42=\"Y\",$C42=\"Y\",$G42=\"Y\",M42=M$3),1,\"\"))","v":""},{"$f":"IF(N$3=\"\",\"\",IF(AND($B42=\"Y\",$C42=\"Y\",$G42=\"Y\",N42=N$3),1,\"\"))","v":""},{"$f":"IF(O$3=\"\",\"\",IF(AND($B42=\"Y\",$C42=\"Y\",$G42=\"Y\",O42=O$3),1,\"\"))","v":""},{"$f":"IF(P$3=\"\",\"\",IF(AND($B42=\"Y\",$C42=\"Y\",$G42=\"Y\",P42=P$3),1,\"\"))","v":""},{"$f":"IF(Q$3=\"\",\"\",IF(AND($B42=\"Y\",$C42=\"Y\",$G42=\"Y\",Q42=Q$3),1,\"\"))","v":""},{"$f":"IF(R$3=\"\",\"\",IF(AND($B42=\"Y\",$C42=\"Y\",$G42=\"Y\",R42=R$3),1,\"\"))","v":""},{"$f":"IF(S$3=\"\",\"\",IF(AND($B42=\"Y\",$C42=\"Y\",$G42=\"Y\",S42=S$3),1,\"\"))","v":""},{"$f":"IF(T$3=\"\",\"\",IF(AND($B42=\"Y\",$C42=\"Y\",$G42=\"Y\",T42=T$3),1,\"\"))","v":""},{"$f":"IF(U$3=\"\",\"\",IF(AND($B42=\"Y\",$C42=\"Y\",$G42=\"Y\",U42=U$3),1,\"\"))","v":""},{"$f":"IF(V$3=\"\",\"\",IF(AND($B42=\"Y\",$C42=\"Y\",$G42=\"Y\",V42=V$3),1,\"\"))","v":""},{"$f":"IF(W$3=\"\",\"\",IF(AND($B42=\"Y\",$C42=\"Y\",$G42=\"Y\",W42=W$3),1,\"\"))","v":""},{"$f":"IF(X$3=\"\",\"\",IF(AND($B42=\"Y\",$C42=\"Y\",$G42=\"Y\",X42=X$3),1,\"\"))","v":""},{"$f":"IF(Y$3=\"\",\"\",IF(AND($B42=\"Y\",$C42=\"Y\",$G42=\"Y\",Y42=Y$3),1,\"\"))","v":""},{"$f":"IF(B42<>\"Y\",\"\",IF(Z42=\"\",\"\",Z42*$E$3))","v":""}]
[38,{"$nulls":24},{"$f":"IF(SUM(AB43:AS43)=0,\"\",SUM(AB43:AS43))","v":""},null,{"$f":"IF(H$3=\"\",\"\",IF(AND($B43=\"Y\",$C43=\"Y\",$G43=\"Y\",H43=H$3),1,\"\"))","v":""},{"$f":"IF(I$3=\"\",\"\",IF(AND($B43=\"Y\",$C43=\"Y\",$G43=\"Y\",I43=I$3),1,\"\"))","v":""},{"$f":"IF(J$3=\"\",\"\",IF(AND($B43=\"Y\",$C43=\"Y\",$G43=\"Y\",J43=J$3),1,\"\"))","v":""},{"$f":"IF(K$3=\"\",\"\",IF(AND($B43=\"Y\",$C43=\"Y\",$G43=\"Y\",K43=K$3),1,\"\"))","v":""},{"$f":"IF(L$3=\"\",\"\",IF(AND($B43=\"Y\",$C43=\"Y\",$G43=\"Y\",L43=L$3),1,\"\"))","v":""},{"$f":"IF(M$3=\"\",\"\",IF(AND($B43=\"Y\",$C43=\"Y\",$G43=\"Y\",M43=M$3),1,\"\"))","v":""},{"$f":"IF(N$3=\"\",\"\",IF(AND($B43=\"Y\",$C43=\"Y\",$G43=\"Y\",N43=N$3),1,\"\"))","v":""},{"$f":"IF(O$3=\"\",\"\",IF(AND($B43=\"Y\",$C43=\"Y\",$G43=\"Y\",O43=O$3),1,\"\"))","v":""},{"$f":"IF(P$3=\"\",\"\",IF(AND($B43=\"Y\",$C43=\"Y\",$G43=\"Y\",P43=P$3),1,\"\"))","v":""},{"$f":"IF(Q$3=\"\",\"\",IF(AND($B43=\"Y\",$C43=\"Y\",$G43=\"Y\",Q43=Q$3),1,\"\"))","v":""},{"$f":"IF(R$3=\"\",\"\",IF(AND($B43=\"Y\",$C43=\"Y\",$G43=\"Y\",R43=R$3),1,\"\"))","v":""},{"$f":"IF(S$3=\"\",\"\",IF(AND($B43=\"Y\",$C43=\"Y\",$G43=\"Y\",S43=S$3),1,\"\"))","v":""},{"$f":"IF(T$3=\"\",\"\",IF(AND($B43=\"Y\",$C43=\"Y\",$G43=\"Y\",T43=T$3),1,\"\"))","v":""},{"$f":"IF(U$3=\"\",\"\",IF(AND($B43=\"Y\",$C43=\"Y\",$G43=\"Y\",U43=U$3),1,\"\"))","v":""},{"$f":"IF(V$3=\"\",\"\",IF(AND($B43=\"Y\",$C43=\"Y\",$G43=\"Y\",V43=V$3),1,\"\"))","v":""},{"$f":"IF(W$3=\"\",\"\",IF(AND($B43=\"Y\",$C43=\"Y\",$G43=\"Y\",W43=W$3),1,\"\"))","v":""},{"$f":"IF(X$3=\"\",\"\",IF(AND($B43=\"Y\",$C43=\"Y\",$G43=\"Y\",X43=X$3),1,\"\"))","v":""},{"$f":"IF(Y$3=\"\",\"\",IF(AND($B43=\"Y\",$C43=\"Y\",$G43=\"Y\",Y43=Y$3),1,\"\"))","v":""},{"$f":"IF(B43<>\"Y\",\"\",IF(Z43=\"\",\"\",Z43*$E$3))","v":""}]
[39,{"$nulls":24},{"$f":"IF(SUM(AB44:AS44)=0,\"\",SUM(AB44:AS44))","v":""},null,{"$f":"IF(H$3=\"\",\"\",IF(AND($B44=\"Y\",$C44=\"Y\",$G44=\"Y\",H44=H$3),1,\"\"))","v":""},{"$f":"IF(I$3=\"\",\"\",IF(AND($B44=\"Y\",$C44=\"Y\",$G44=\"Y\",I44=I$3),1,\"\"))","v":""},{"$f":"IF(J$3=\"\",\"\",IF(AND($B44=\"Y\",$C44=\"Y\",$G44=\"Y\",J44=J$3),1,\"\"))","v":""},{"$f":"IF(K$3=\"\",\"\",IF(AND($B44=\"Y\",$C44=\"Y\",$G44=\"Y\",K44=K$3),1,\"\"))","v":""},{"$f":"IF(L$3=\"\",\"\",IF(AND($B44=\"Y\",$C44=\"Y\",$G44=\"Y\",L44=L$3),1,\"\"))","v":""},{"$f":"IF(M$3=\"\",\"\",IF(AND($B44=\"Y\",$C44=\"Y\",$G44=\"Y\",M44=M$3),1,\"\"))","v":""},{"$f":"IF(N$3=\"\",\"\",IF(AND($B44=\"Y\",$C44=\"Y\",$G44=\"Y\",N44=N$3),1,\"\"))","v":""},{"$f":"IF(O$3=\"\",\"\",IF(AND($B44=\"Y\",$C44=\"Y\",$G44=\"Y\",O44=O$3),1,\"\"))","v":""},{"$f":"IF(P$3=\"\",\"\",IF(AND($B44=\"Y\",$C44=\"Y\",$G44=\"Y\",P44=P$3),1,\"\"))","v":""},{"$f":"IF(Q$3=\"\",\"\",IF(AND($B44=\"Y\",$C44=\"Y\",$G44=\"Y\",Q44=Q$3),1,\"\"))","v":""},{"$f":"IF(R$3=\"\",\"\",IF(AND($B44=\"Y\",$C44=\"Y\",$G44=\"Y\",R44=R$3),1,\"\"))","v":""},{"$f":"IF(S$3=\"\",\"\",IF(AND($B44=\"Y\",$C44=\"Y\",$G44=\"Y\",S44=S$3),1,\"\"))","v":""},{"$f":"IF(T$3=\"\",\"\",IF(AND($B44=\"Y\",$C44=\"Y\",$G44=\"Y\",T44=T$3),1,\"\"))","v":""},{"$f":"IF(U$3=\"\",\"\",IF(AND($B44=\"Y\",$C44=\"Y\",$G44=\"Y\",U44=U$3),1,\"\"))","v":""},{"$f":"IF(V$3=\"\",\"\",IF(AND($B44=\"Y\",$C44=\"Y\",$G44=\"Y\",V44=V$3),1,\"\"))","v":""},{"$f":"IF(W$3=\"\",\"\",IF(AND($B44=\"Y\",$C44=\"Y\",$G44=\"Y\",W44=W$3),1,\"\"))","v":""},{"$f":"IF(X$3=\"\",\"\",IF(AND($B44=\"Y\",$C44=\"Y\",$G44=\"Y\",X44=X$3),1,\"\"))","v":""},{"$f":"IF(Y$3=\"\",\"\",IF(AND($B44=\"Y\",$C44=\"Y\",$G44=\"Y\",Y44=Y$3),1,\"\"))","v":""},{"$f":"IF(B44<>\"Y\",\"\",IF(Z44=\"\",\"\",Z44*$E$3))","v":""}]
[40,{"$nulls":24},{"$f":"IF(SUM(AB45:AS45)=0,\"\",SUM(AB45:AS45))","v":""},null,{"$f":"IF(H$3=\"\",\"\",IF(AND($B45=\"Y\",$C45=\"Y\",$G45=\"Y\",H45=H$3),1,\"\"))","v":""},{"$f":"IF(I$3=\"\",\"\",IF(AND($B45=\"Y\",$C45=\"Y\",$G45=\"Y\",I45=I$3),1,\"\"))","v":""},{"$f":"IF(J$3=\"\",\"\",IF(AND($B45=\"Y\",$C45=\"Y\",$G45=\"Y\",J45=J$3),1,\"\"))","v":""},{"$f":"IF(K$3=\"\",\"\",IF(AND($B45=\"Y\",$C45=\"Y\",$G45=\"Y\",K45=K$3),1,\"\"))","v":""},{"$f":"IF(L$3=\"\",\"\",IF(AND($B45=\"Y\",$C45=\"Y\",$G45=\"Y\",L45=L$3),1,\"\"))","v":""},{"$f":"IF(M$3=\"\",\"\",IF(AND($B45=\"Y\",$C45=\"Y\",$G45=\"Y\",M45=M$3),1,\"\"))","v":""},{"$f":"IF(N$3=\"\",\"\",IF(AND($B45=\"Y\",$C45=\"Y\",$G45=\"Y\",N45=N$3),1,\"\"))","v":""},{"$f":"IF(O$3=\"\",\"\",IF(AND($B45=\"Y\",$C45=\"Y\",$G45=\"Y\",O45=O$3),1,\"\"))","v":""},{"$f":"IF(P$3=\"\",\"\",IF(AND($B45=\"Y\",$C45=\"Y\",$G45=\"Y\",P45=P$3),1,\"\"))","v":""},{"$f":"IF(Q$3=\"\",\"\",IF(AND($B45=\"Y\",$C45=\"Y\",$G45=\"Y\",Q45=Q$3),1,\"\"))","v":""},{"$f":"IF(R$3=\"\",\"\",IF(AND($B45=\"Y\",$C45=\"Y\",$G45=\"Y\",R45=R$3),1,\"\"))","v":""},{"$f":"IF(S$3=\"\",\"\",IF(AND($B45=\"Y\",$C45=\"Y\",$G45=\"Y\",S45=S$3),1,\"\"))","v":""},{"$f":"IF(T$3=\"\",\"\",IF(AND($B45=\"Y\",$C45=\"Y\",$G45=\"Y\",T45=T$3),1,\"\"))","v":""},{"$f":"IF(U$3=\"\",\"\",IF(AND($B45=\"Y\",$C45=\"Y\",$G45=\"Y\",U45=U$3),1,\"\"))","v":""},{"$f":"IF(V$3=\"\",\"\",IF(AND($B45=\"Y\",$C45=\"Y\",$G45=\"Y\",V45=V$3),1,\"\"))","v":""},{"$f":"IF(W$3=\"\",\"\",IF(AND($B45=\"Y\",$C45=\"Y\",$G45=\"Y\",W45=W$3),1,\"\"))","v":""},{"$f":"IF(X$3=\"\",\"\",IF(AND($B45=\"Y\",$C45=\"Y\",$G45=\"Y\",X45=X$3),1,\"\"))","v":""},{"$f":"IF(Y$3=\"\",\"\",IF(AND($B45=\"Y\",$C45=\"Y\",$G45=\"Y\",Y45=Y$3),1,\"\"))","v":""},{"$f":"IF(B45<>\"Y\",\"\",IF(Z45=\"\",\"\",Z45*$E$3))","v":""}]
[41,{"$nulls":24},{"$f":"IF(SUM(AB46:AS46)=0,\"\",SUM(AB46:AS46))","v":""},null,{"$f":"IF(H$3=\"\",\"\",IF(AND($B46=\"Y\",$C46=\"Y\",$G46=\"Y\",H46=H$3),1,\"\"))","v":""},{"$f":"IF(I$3=\"\",\"\",IF(AND($B46=\"Y\",$C46=\"Y\",$G46=\"Y\",I46=I$3),1,\"\"))","v":""},{"$f":"IF(J$3=\"\",\"\",IF(AND($B46=\"Y\",$C46=\"Y\",$G46=\"Y\",J46=J$3),1,\"\"))","v":""},{"$f":"IF(K$3=\"\",\"\",IF(AND($B46=\"Y\",$C46=\"Y\",$G46=\"Y\",K46=K$3),1,\"\"))","v":""},{"$f":"IF(L$3=\"\",\"\",IF(AND($B46=\"Y\",$C46=\"Y\",$G46=\"Y\",L46=L$3),1,\"\"))","v":""},{"$f":"IF(M$3=\"\",\"\",IF(AND($B46=\"Y\",$C46=\"Y\",$G46=\"Y\",M46=M$3),1,\"\"))","v":""},{"$f":"IF(N$3=\"\",\"\",IF(AND($B46=\"Y\",$C46=\"Y\",$G46=\"Y\",N46=N$3),1,\"\"))","v":""},{"$f":"IF(O$3=\"\",\"\",IF(AND($B46=\"Y\",$C46=\"Y\",$G46=\"Y\",O46=O$3),1,\"\"))","v":""},{"$f":"IF(P$3=\"\",\"\",IF(AND($B46=\"Y\",$C46=\"Y\",$G46=\"Y\",P46=P$3),1,\"\"))","v":""},{"$f":"IF(Q$3=\"\",\"\",IF(AND($B46=\"Y\",$C46=\"Y\",$G46=\"Y\",Q46=Q$3),1,\"\"))","v":""},{"$f":"IF(R$3=\"\",\"\",IF(AND($B46=\"Y\",$C46=\"Y\",$G46=\"Y\",R46=R$3),1,\"\"))","v":""},{"$f":"IF(S$3=\"\",\"\",IF(AND($B46=\"Y\",$C46=\"Y\",$G46=\"Y\",S46=S$3),1,\"\"))","v":""},{"$f":"IF(T$3=\"\",\"\",IF(AND($B46=\"Y\",$C46=\"Y\",$G46=\"Y\",T46=T$3),1,\"\"))","v":""},{"$f":"IF(U$3=\"\",\"\",IF(AND($B46=\"Y\",$C46=\"Y\",$G46=\"Y\",U46=U$3),1,\"\"))","v":""},{"$f":"IF(V$3=\"\",\"\",IF(AND($B46=\"Y\",$C46=\"Y\",$G46=\"Y\",V46=V$3),1,\"\"))","v":""},{"$f":"IF(W$3=\"\",\"\",IF(AND($B46=\"Y\",$C46=\"Y\",$G46=\"Y\",W46=W$3),1,\"\"))","v":""},{"$f":"IF(X$3=\"\",\"\",IF(AND($B46=\"Y\",$C46=\"Y\",$G46=\"Y\",X46=X$3),1,\"\"))","v":""},{"$f":"IF(Y$3=\"\",\"\",IF(AND($B46=\"Y\",$C46=\"Y\",$G46=\"Y\",Y46=Y$3),1,\"\"))","v":""},{"$f":"IF(B46<>\"Y\",\"\",IF(Z46=\"\",\"\",Z46*$E$3))","v":""}]
[42,{"$nulls":24},{"$f":"IF(SUM(AB47:AS47)=0,\"\",SUM(AB47:AS47))","v":""},null,{"$f":"IF(H$3=\"\",\"\",IF(AND($B47=\"Y\",$C47=\"Y\",$G47=\"Y\",H47=H$3),1,\"\"))","v":""},{"$f":"IF(I$3=\"\",\"\",IF(AND($B47=\"Y\",$C47=\"Y\",$G47=\"Y\",I47=I$3),1,\"\"))","v":""},{"$f":"IF(J$3=\"\",\"\",IF(AND($B47=\"Y\",$C47=\"Y\",$G47=\"Y\",J47=J$3),1,\"\"))","v":""},{"$f":"IF(K$3=\"\",\"\",IF(AND($B47=\"Y\",$C47=\"Y\",$G47=\"Y\",K47=K$3),1,\"\"))","v":""},{"$f":"IF(L$3=\"\",\"\",IF(AND($B47=\"Y\",$C47=\"Y\",$G47=\"Y\",L47=L$3),1,\"\"))","v":""},{"$f":"IF(M$3=\"\",\"\",IF(AND($B47=\"Y\",$C47=\"Y\",$G47=\"Y\",M47=M$3),1,\"\"))","v":""},{"$f":"IF(N$3=\"\",\"\",IF(AND($B47=\"Y\",$C47=\"Y\",$G47=\"Y\",N47=N$3),1,\"\"))","v":""},{"$f":"IF(O$3=\"\",\"\",IF(AND($B47=\"Y\",$C47=\"Y\",$G47=\"Y\",O47=O$3),1,\"\"))","v":""},{"$f":"IF(P$3=\"\",\"\",IF(AND($B47=\"Y\",$C47=\"Y\",$G47=\"Y\",P47=P$3),1,\"\"))","v":""},{"$f":"IF(Q$3=\"\",\"\",IF(AND($B47=\"Y\",$C47=\"Y\",$G47=\"Y\",Q47=Q$3),1,\"\"))","v":""},{"$f":"IF(R$3=\"\",\"\",IF(AND($B47=\"Y\",$C47=\"Y\",$G47=\"Y\",R47=R$3),1,\"\"))","v":""},{"$f":"IF(S$3=\"\",\"\",IF(AND($B47=\"Y\",$C47=\"Y\",$G47=\"Y\",S47=S$3),1,\"\"))","v":""},{"$f":"IF(T$3=\"\",\"\",IF(AND($B47=\"Y\",$C47=\"Y\",$G47=\"Y\",T47=T$3),1,\"\"))","v":""},{"$f":"IF(U$3=\"\",\"\",IF(AND($B47=\"Y\",$C47=\"Y\",$G47=\"Y\",U47=U$3),1,\"\"))","v":""},{"$f":"IF(V$3=\"\",\"\",IF(AND($B47=\"Y\",$C47=\"Y\",$G47=\"Y\",V47=V$3),1,\"\"))","v":""},{"$f":"IF(W$3=\"\",\"\",IF(AND($B47=\"Y\",$C47=\"Y\",$G47=\"Y\",W47=W$3),1,\"\"))","v":""},{"$f":"IF(X$3=\"\",\"\",IF(AND($B47=\"Y\",$C47=\"Y\",$G47=\"Y\",X47=X$3),1,\"\"))","v":""},{"$f":"IF(Y$3=\"\",\"\",IF(AND($B47=\"Y\",$C47=\"Y\",$G47=\"Y\",Y47=Y$3),1,\"\"))","v":""},{"$f":"IF(B47<>\"Y\",\"\",IF(Z47=\"\",\"\",Z47*$E$3))","v":""}]
[43,{"$nulls":24},{"$f":"IF(SUM(AB48:AS48)=0,\"\",SUM(AB48:AS48))","v":""},null,{"$f":"IF(H$3=\"\",\"\",IF(AND($B48=\"Y\",$C48=\"Y\",$G48=\"Y\",H48=H$3),1,\"\"))","v":""},{"$f":"IF(I$3=\"\",\"\",IF(AND($B48=\"Y\",$C48=\"Y\",$G48=\"Y\",I48=I$3),1,\"\"))","v":""},{"$f":"IF(J$3=\"\",\"\",IF(AND($B48=\"Y\",$C48=\"Y\",$G48=\"Y\",J48=J$3),1,\"\"))","v":""},{"$f":"IF(K$3=\"\",\"\",IF(AND($B48=\"Y\",$C48=\"Y\",$G48=\"Y\",K48=K$3),1,\"\"))","v":""},{"$f":"IF(L$3=\"\",\"\",IF(AND($B48=\"Y\",$C48=\"Y\",$G48=\"Y\",L48=L$3),1,\"\"))","v":""},{"$f":"IF(M$3=\"\",\"\",IF(AND($B48=\"Y\",$C48=\"Y\",$G48=\"Y\",M48=M$3),1,\"\"))","v":""},{"$f":"IF(N$3=\"\",\"\",IF(AND($B48=\"Y\",$C48=\"Y\",$G48=\"Y\",N48=N$3),1,\"\"))","v":""},{"$f":"IF(O$3=\"\",\"\",IF(AND($B48=\"Y\",$C48=\"Y\",$G48=\"Y\",O48=O$3),1,\"\"))","v":""},{"$f":"IF(P$3=\"\",\"\",IF(AND($B48=\"Y\",$C48=\"Y\",$G48=\"Y\",P48=P$3),1,\"\"))","v":""},{"$f":"IF(Q$3=\"\",\"\",IF(AND($B48=\"Y\",$C48=\"Y\",$G48=\"Y\",Q48=Q$3),1,\"\"))","v":""},{"$f":"IF(R$3=\"\",\"\",IF(AND($B48=\"Y\",$C48=\"Y\",$G48=\"Y\",R48=R$3),1,\"\"))","v":""},{"$f":"IF(S$3=\"\",\"\",IF(AND($B48=\"Y\",$C48=\"Y\",$G48=\"Y\",S48=S$3),1,\"\"))","v":""},{"$f":"IF(T$3=\"\",\"\",IF(AND($B48=\"Y\",$C48=\"Y\",$G48=\"Y\",T48=T$3),1,\"\"))","v":""},{"$f":"IF(U$3=\"\",\"\",IF(AND($B48=\"Y\",$C48=\"Y\",$G48=\"Y\",U48=U$3),1,\"\"))","v":""},{"$f":"IF(V$3=\"\",\"\",IF(AND($B48=\"Y\",$C48=\"Y\",$G48=\"Y\",V48=V$3),1,\"\"))","v":""},{"$f":"IF(W$3=\"\",\"\",IF(AND($B48=\"Y\",$C48=\"Y\",$G48=\"Y\",W48=W$3),1,\"\"))","v":""},{"$f":"IF(X$3=\"\",\"\",IF(AND($B48=\"Y\",$C48=\"Y\",$G48=\"Y\",X48=X$3),1,\"\"))","v":""},{"$f":"IF(Y$3=\"\",\"\",IF(AND($B48=\"Y\",$C48=\"Y\",$G48=\"Y\",Y48=Y$3),1,\"\"))","v":""},{"$f":"IF(B48<>\"Y\",\"\",IF(Z48=\"\",\"\",Z48*$E$3))","v":""}]
[44,{"$nulls":24},{"$f":"IF(SUM(AB49:AS49)=0,\"\",SUM(AB49:AS49))","v":""},null,{"$f":"IF(H$3=\"\",\"\",IF(AND($B49=\"Y\",$C49=\"Y\",$G49=\"Y\",H49=H$3),1,\"\"))","v":""},{"$f":"IF(I$3=\"\",\"\",IF(AND($B49=\"Y\",$C49=\"Y\",$G49=\"Y\",I49=I$3),1,\"\"))","v":""},{"$f":"IF(J$3=\"\",\"\",IF(AND($B49=\"Y\",$C49=\"Y\",$G49=\"Y\",J49=J$3),1,\"\"))","v":""},{"$f":"IF(K$3=\"\",\"\",IF(AND($B49=\"Y\",$C49=\"Y\",$G49=\"Y\",K49=K$3),1,\"\"))","v":""},{"$f":"IF(L$3=\"\",\"\",IF(AND($B49=\"Y\",$C49=\"Y\",$G49=\"Y\",L49=L$3),1,\"\"))","v":""},{"$f":"IF(M$3=\"\",\"\",IF(AND($B49=\"Y\",$C49=\"Y\",$G49=\"Y\",M49=M$3),1,\"\"))","v":""},{"$f":"IF(N$3=\"\",\"\",IF(AND($B49=\"Y\",$C49=\"Y\",$G49=\"Y\",N49=N$3),1,\"\"))","v":""},{"$f":"IF(O$3=\"\",\"\",IF(AND($B49=\"Y\",$C49=\"Y\",$G49=\"Y\",O49=O$3),1,\"\"))","v":""},{"$f":"IF(P$3=\"\",\"\",IF(AND($B49=\"Y\",$C49=\"Y\",$G49=\"Y\",P49=P$3),1,\"\"))","v":""},{"$f":"IF(Q$3=\"\",\"\",IF(AND($B49=\"Y\",$C49=\"Y\",$G49=\"Y\",Q49=Q$3),1,\"\"))","v":""},{"$f":"IF(R$3=\"\",\"\",IF(AND($B49=\"Y\",$C49=\"Y\",$G49=\"Y\",R49=R$3),1,\"\"))","v":""},{"$f":"IF(S$3=\"\",\"\",IF(AND($B49=\"Y\",$C49=\"Y\",$G49=\"Y\",S49=S$3),1,\"\"))","v":""},{"$f":"IF(T$3=\"\",\"\",IF(AND($B49=\"Y\",$C49=\"Y\",$G49=\"Y\",T49=T$3),1,\"\"))","v":""},{"$f":"IF(U$3=\"\",\"\",IF(AND($B49=\"Y\",$C49=\"Y\",$G49=\"Y\",U49=U$3),1,\"\"))","v":""},{"$f":"IF(V$3=\"\",\"\",IF(AND($B49=\"Y\",$C49=\"Y\",$G49=\"Y\",V49=V$3),1,\"\"))","v":""},{"$f":"IF(W$3=\"\",\"\",IF(AND($B49=\"Y\",$C49=\"Y\",$G49=\"Y\",W49=W$3),1,\"\"))","v":""},{"$f":"IF(X$3=\"\",\"\",IF(AND($B49=\"Y\",$C49=\"Y\",$G49=\"Y\",X49=X$3),1,\"\"))","v":""},{"$f":"IF(Y$3=\"\",\"\",IF(AND($B49=\"Y\",$C49=\"Y\",$G49=\"Y\",Y49=Y$3),1,\"\"))","v":""},{"$f":"IF(B49<>\"Y\",\"\",IF(Z49=\"\",\"\",Z49*$E$3))","v":""}]
[45,{"$nulls":24},{"$f":"IF(SUM(AB50:AS50)=0,\"\",SUM(AB50:AS50))","v":""},null,{"$f":"IF(H$3=\"\",\"\",IF(AND($B50=\"Y\",$C50=\"Y\",$G50=\"Y\",H50=H$3),1,\"\"))","v":""},{"$f":"IF(I$3=\"\",\"\",IF(AND($B50=\"Y\",$C50=\"Y\",$G50=\"Y\",I50=I$3),1,\"\"))","v":""},{"$f":"IF(J$3=\"\",\"\",IF(AND($B50=\"Y\",$C50=\"Y\",$G50=\"Y\",J50=J$3),1,\"\"))","v":""},{"$f":"IF(K$3=\"\",\"\",IF(AND($B50=\"Y\",$C50=\"Y\",$G50=\"Y\",K50=K$3),1,\"\"))","v":""},{"$f":"IF(L$3=\"\",\"\",IF(AND($B50=\"Y\",$C50=\"Y\",$G50=\"Y\",L50=L$3),1,\"\"))","v":""},{"$f":"IF(M$3=\"\",\"\",IF(AND($B50=\"Y\",$C50=\"Y\",$G50=\"Y\",M50=M$3),1,\"\"))","v":""},{"$f":"IF(N$3=\"\",\"\",IF(AND($B50=\"Y\",$C50=\"Y\",$G50=\"Y\",N50=N$3),1,\"\"))","v":""},{"$f":"IF(O$3=\"\",\"\",IF(AND($B50=\"Y\",$C50=\"Y\",$G50=\"Y\",O50=O$3),1,\"\"))","v":""},{"$f":"IF(P$3=\"\",\"\",IF(AND($B50=\"Y\",$C50=\"Y\",$G50=\"Y\",P50=P$3),1,\"\"))","v":""},{"$f":"IF(Q$3=\"\",\"\",IF(AND($B50=\"Y\",$C50=\"Y\",$G50=\"Y\",Q50=Q$3),1,\"\"))","v":""},{"$f":"IF(R$3=\"\",\"\",IF(AND($B50=\"Y\",$C50=\"Y\",$G50=\"Y\",R50=R$3),1,\"\"))","v":""},{"$f":"IF(S$3=\"\",\"\",IF(AND($B50=\"Y\",$C50=\"Y\",$G50=\"Y\",S50=S$3),1,\"\"))","v":""},{"$f":"IF(T$3=\"\",\"\",IF(AND($B50=\"Y\",$C50=\"Y\",$G50=\"Y\",T50=T$3),1,\"\"))","v":""},{"$f":"IF(U$3=\"\",\"\",IF(AND($B50=\"Y\",$C50=\"Y\",$G50=\"Y\",U50=U$3),1,\"\"))","v":""},{"$f":"IF(V$3=\"\",\"\",IF(AND($B50=\"Y\",$C50=\"Y\",$G50=\"Y\",V50=V$3),1,\"\"))","v":""},{"$f":"IF(W$3=\"\",\"\",IF(AND($B50=\"Y\",$C50=\"Y\",$G50=\"Y\",W50=W$3),1,\"\"))","v":""},{"$f":"IF(X$3=\"\",\"\",IF(AND($B50=\"Y\",$C50=\"Y\",$G50=\"Y\",X50=X$3),1,\"\"))","v":""},{"$f":"IF(Y$3=\"\",\"\",IF(AND($B50=\"Y\",$C50=\"Y\",$G50=\"Y\",Y50=Y$3),1,\"\"))","v":""},{"$f":"IF(B50<>\"Y\",\"\",IF(Z50=\"\",\"\",Z50*$E$3))","v":""}]
[46,{"$nulls":24},{"$f":"IF(SUM(AB51:AS51)=0,\"\",SUM(AB51:AS51))","v":""},null,{"$f":"IF(H$3=\"\",\"\",IF(AND($B51=\"Y\",$C51=\"Y\",$G51=\"Y\",H51=H$3),1,\"\"))","v":""},{"$f":"IF(I$3=\"\",\"\",IF(AND($B51=\"Y\",$C51=\"Y\",$G51=\"Y\",I51=I$3),1,\"\"))","v":""},{"$f":"IF(J$3=\"\",\"\",IF(AND($B51=\"Y\",$C51=\"Y\",$G51=\"Y\",J51=J$3),1,\"\"))","v":""},{"$f":"IF(K$3=\"\",\"\",IF(AND($B51=\"Y\",$C51=\"Y\",$G51=\"Y\",K51=K$3),1,\"\"))","v":""},{"$f":"IF(L$3=\"\",\"\",IF(AND($B51=\"Y\",$C51=\"Y\",$G51=\"Y\",L51=L$3),1,\"\"))","v":""},{"$f":"IF(M$3=\"\",\"\",IF(AND($B51=\"Y\",$C51=\"Y\",$G51=\"Y\",M51=M$3),1,\"\"))","v":""},{"$f":"IF(N$3=\"\",\"\",IF(AND($B51=\"Y\",$C51=\"Y\",$G51=\"Y\",N51=N$3),1,\"\"))","v":""},{"$f":"IF(O$3=\"\",\"\",IF(AND($B51=\"Y\",$C51=\"Y\",$G51=\"Y\",O51=O$3),1,\"\"))","v":""},{"$f":"IF(P$3=\"\",\"\",IF(AND($B51=\"Y\",$C51=\"Y\",$G51=\"Y\",P51=P$3),1,\"\"))","v":""},{"$f":"IF(Q$3=\"\",\"\",IF(AND($B51=\"Y\",$C51=\"Y\",$G51=\"Y\",Q51=Q$3),1,\"\"))","v":""},{"$f":"IF(R$3=\"\",\"\",IF(AND($B51=\"Y\",$C51=\"Y\",$G51=\"Y\",R51=R$3),1,\"\"))","v":""},{"$f":"IF(S$3=\"\",\"\",IF(AND($B51=\"Y\",$C51=\"Y\",$G51=\"Y\",S51=S$3),1,\"\"))","v":""},{"$f":"IF(T$3=\"\",\"\",IF(AND($B51=\"Y\",$C51=\"Y\",$G51=\"Y\",T51=T$3),1,\"\"))","v":""},{"$f":"IF(U$3=\"\",\"\",IF(AND($B51=\"Y\",$C51=\"Y\",$G51=\"Y\",U51=U$3),1,\"\"))","v":""},{"$f":"IF(V$3=\"\",\"\",IF(AND($B51=\"Y\",$C51=\"Y\",$G51=\"Y\",V51=V$3),1,\"\"))","v":""},{"$f":"IF(W$3=\"\",\"\",IF(AND($B51=\"Y\",$C51=\"Y\",$G51=\"Y\",W51=W$3),1,\"\"))","v":""},{"$f":"IF(X$3=\"\",\"\",IF(AND($B51=\"Y\",$C51=\"Y\",$G51=\"Y\",X51=X$3),1,\"\"))","v":""},{"$f":"IF(Y$3=\"\",\"\",IF(AND($B51=\"Y\",$C51=\"Y\",$G51=\"Y\",Y51=Y$3),1,\"\"))","v":""},{"$f":"IF(B51<>\"Y\",\"\",IF(Z51=\"\",\"\",Z51*$E$3))","v":""}]
[47,{"$nulls":24},{"$f":"IF(SUM(AB52:AS52)=0,\"\",SUM(AB52:AS52))","v":""},null,{"$f":"IF(H$3=\"\",\"\",IF(AND($B52=\"Y\",$C52=\"Y\",$G52=\"Y\",H52=H$3),1,\"\"))","v":""},{"$f":"IF(I$3=\"\",\"\",IF(AND($B52=\"Y\",$C52=\"Y\",$G52=\"Y\",I52=I$3),1,\"\"))","v":""},{"$f":"IF(J$3=\"\",\"\",IF(AND($B52=\"Y\",$C52=\"Y\",$G52=\"Y\",J52=J$3),1,\"\"))","v":""},{"$f":"IF(K$3=\"\",\"\",IF(AND($B52=\"Y\",$C52=\"Y\",$G52=\"Y\",K52=K$3),1,\"\"))","v":""},{"$f":"IF(L$3=\"\",\"\",IF(AND($B52=\"Y\",$C52=\"Y\",$G52=\"Y\",L52=L$3),1,\"\"))","v":""},{"$f":"IF(M$3=\"\",\"\",IF(AND($B52=\"Y\",$C52=\"Y\",$G52=\"Y\",M52=M$3),1,\"\"))","v":""},{"$f":"IF(N$3=\"\",\"\",IF(AND($B52=\"Y\",$C52=\"Y\",$G52=\"Y\",N52=N$3),1,\"\"))","v":""},{"$f":"IF(O$3=\"\",\"\",IF(AND($B52=\"Y\",$C52=\"Y\",$G52=\"Y\",O52=O$3),1,\"\"))","v":""},{"$f":"IF(P$3=\"\",\"\",IF(AND($B52=\"Y\",$C52=\"Y\",$G52=\"Y\",P52=P$3),1,\"\"))","v":""},{"$f":"IF(Q$3=\"\",\"\",IF(AND($B52=\"Y\",$C52=\"Y\",$G52=\"Y\",Q52=Q$3),1,\"\"))","v":""},{"$f":"IF(R$3=\"\",\"\",IF(AND($B52=\"Y\",$C52=\"Y\",$G52=\"Y\",R52=R$3),1,\"\"))","v":""},{"$f":"IF(S$3=\"\",\"\",IF(AND($B52=\"Y\",$C52=\"Y\",$G52=\"Y\",S52=S$3),1,\"\"))","v":""},{"$f":"IF(T$3=\"\",\"\",IF(AND($B52=\"Y\",$C52=\"Y\",$G52=\"Y\",T52=T$3),1,\"\"))","v":""},{"$f":"IF(U$3=\"\",\"\",IF(AND($B52=\"Y\",$C52=\"Y\",$G52=\"Y\",U52=U$3),1,\"\"))","v":""},{"$f":"IF(V$3=\"\",\"\",IF(AND($B52=\"Y\",$C52=\"Y\",$G52=\"Y\",V52=V$3),1,\"\"))","v":""},{"$f":"IF(W$3=\"\",\"\",IF(AND($B52=\"Y\",$C52=\"Y\",$G52=\"Y\",W52=W$3),1,\"\"))","v":""},{"$f":"IF(X$3=\"\",\"\",IF(AND($B52=\"Y\",$C52=\"Y\",$G52=\"Y\",X52=X$3),1,\"\"))","v":""},{"$f":"IF(Y$3=\"\",\"\",IF(AND($B52=\"Y\",$C52=\"Y\",$G52=\"Y\",Y52=Y$3),1,\"\"))","v":""},{"$f":"IF(B52<>\"Y\",\"\",IF(Z52=\"\",\"\",Z52*$E$3))","v":""}]
[48,{"$nulls":24},{"$f":"IF(SUM(AB53:AS53)=0,\"\",SUM(AB53:AS53))","v":""},null,{"$f":"IF(H$3=\"\",\"\",IF(AND($B53=\"Y\",$C53=\"Y\",$G53=\"Y\",H53=H$3),1,\"\"))","v":""},{"$f":"IF(I$3=\"\",\"\",IF(AND($B53=\"Y\",$C53=\"Y\",$G53=\"Y\",I53=I$3),1,\"\"))","v":""},{"$f":"IF(J$3=\"\",\"\",IF(AND($B53=\"Y\",$C53=\"Y\",$G53=\"Y\",J53=J$3),1,\"\"))","v":""},{"$f":"IF(K$3=\"\",\"\",IF(AND($B53=\"Y\",$C53=\"Y\",$G53=\"Y\",K53=K$3),1,\"\"))","v":""},{"$f":"IF(L$3=\"\",\"\",IF(AND($B53=\"Y\",$C53=\"Y\",$G53=\"Y\",L53=L$3),1,\"\"))","v":""},{"$f":"IF(M$3=\"\",\"\",IF(AND($B53=\"Y\",$C53=\"Y\",$G53=\"Y\",M53=M$3),1,\"\"))","v":""},{"$f":"IF(N$3=\"\",\"\",IF(AND($B53=\"Y\",$C53=\"Y\",$G53=\"Y\",N53=N$3),1,\"\"))","v":""},{"$f":"IF(O$3=\"\",\"\",IF(AND($B53=\"Y\",$C53=\"Y\",$G53=\"Y\",O53=O$3),1,\"\"))","v":""},{"$f":"IF(P$3=\"\",\"\",IF(AND($B53=\"Y\",$C53=\"Y\",$G53=\"Y\",P53=P$3),1,\"\"))","v":""},{"$f":"IF(Q$3=\"\",\"\",IF(AND($B53=\"Y\",$C53=\"Y\",$G53=\"Y\",Q53=Q$3),1,\"\"))","v":""},{"$f":"IF(R$3=\"\",\"\",IF(AND($B53=\"Y\",$C53=\"Y\",$G53=\"Y\",R53=R$3),1,\"\"))","v":""},{"$f":"IF(S$3=\"\",\"\",IF(AND($B53=\"Y\",$C53=\"Y\",$G53=\"Y\",S53=S$3),1,\"\"))","v":""},{"$f":"IF(T$3=\"\",\"\",IF(AND($B53=\"Y\",$C53=\"Y\",$G53=\"Y\",T53=T$3),1,\"\"))","v":""},{"$f":"IF(U$3=\"\",\"\",IF(AND($B53=\"Y\",$C53=\"Y\",$G53=\"Y\",U53=U$3),1,\"\"))","v":""},{"$f":"IF(V$3=\"\",\"\",IF(AND($B53=\"Y\",$C53=\"Y\",$G53=\"Y\",V53=V$3),1,\"\"))","v":""},{"$f":"IF(W$3=\"\",\"\",IF(AND($B53=\"Y\",$C53=\"Y\",$G53=\"Y\",W53=W$3),1,\"\"))","v":""},{"$f":"IF(X$3=\"\",\"\",IF(AND($B53=\"Y\",$C53=\"Y\",$G53=\"Y\",X53=X$3),1,\"\"))","v":""},{"$f":"IF(Y$3=\"\",\"\",IF(AND($B53=\"Y\",$C53=\"Y\",$G53=\"Y\",Y53=Y$3),1,\"\"))","v":""},{"$f":"IF(B53<>\"Y\",\"\",IF(Z53=\"\",\"\",Z53*$E$3))","v":""}]
[49,{"$nulls":24},{"$f":"IF(SUM(AB54:AS54)=0,\"\",SUM(AB54:AS54))","v":""},null,{"$f":"IF(H$3=\"\",\"\",IF(AND($B54=\"Y\",$C54=\"Y\",$G54=\"Y\",H54=H$3),1,\"\"))","v":""},{"$f":"IF(I$3=\"\",\"\",IF(AND($B54=\"Y\",$C54=\"Y\",$G54=\"Y\",I54=I$3),1,\"\"))","v":""},{"$f":"IF(J$3=\"\",\"\",IF(AND($B54=\"Y\",$C54=\"Y\",$G54=\"Y\",J54=J$3),1,\"\"))","v":""},{"$f":"IF(K$3=\"\",\"\",IF(AND($B54=\"Y\",$C54=\"Y\",$G54=\"Y\",K54=K$3),1,\"\"))","v":""},{"$f":"IF(L$3=\"\",\"\",IF(AND($B54=\"Y\",$C54=\"Y\",$G54=\"Y\",L54=L$3),1,\"\"))","v":""},{"$f":"IF(M$3=\"\",\"\",IF(AND($B54=\"Y\",$C54=\"Y\",$G54=\"Y\",M54=M$3),1,\"\"))","v":""},{"$f":"IF(N$3=\"\",\"\",IF(AND($B54=\"Y\",$C54=\"Y\",$G54=\"Y\",N54=N$3),1,\"\"))","v":""},{"$f":"IF(O$3=\"\",\"\",IF(AND($B54=\"Y\",$C54=\"Y\",$G54=\"Y\",O54=O$3),1,\"\"))","v":""},{"$f":"IF(P$3=\"\",\"\",IF(AND($B54=\"Y\",$C54=\"Y\",$G54=\"Y\",P54=P$3),1,\"\"))","v":""},{"$f":"IF(Q$3=\"\",\"\",IF(AND($B54=\"Y\",$C54=\"Y\",$G54=\"Y\",Q54=Q$3),1,\"\"))","v":""},{"$f":"IF(R$3=\"\",\"\",IF(AND($B54=\"Y\",$C54=\"Y\",$G54=\"Y\",R54=R$3),1,\"\"))","v":""},{"$f":"IF(S$3=\"\",\"\",IF(AND($B54=\"Y\",$C54=\"Y\",$G54=\"Y\",S54=S$3),1,\"\"))","v":""},{"$f":"IF(T$3=\"\",\"\",IF(AND($B54=\"Y\",$C54=\"Y\",$G54=\"Y\",T54=T$3),1,\"\"))","v":""},{"$f":"IF(U$3=\"\",\"\",IF(AND($B54=\"Y\",$C54=\"Y\",$G54=\"Y\",U54=U$3),1,\"\"))","v":""},{"$f":"IF(V$3=\"\",\"\",IF(AND($B54=\"Y\",$C54=\"Y\",$G54=\"Y\",V54=V$3),1,\"\"))","v":""},{"$f":"IF(W$3=\"\",\"\",IF(AND($B54=\"Y\",$C54=\"Y\",$G54=\"Y\",W54=W$3),1,\"\"))","v":""},{"$f":"IF(X$3=\"\",\"\",IF(AND($B54=\"Y\",$C54=\"Y\",$G54=\"Y\",X54=X$3),1,\"\"))","v":""},{"$f":"IF(Y$3=\"\",\"\",IF(AND($B54=\"Y\",$C54=\"Y\",$G54=\"Y\",Y54=Y$3),1,\"\"))","v":""},{"$f":"IF(B54<>\"Y\",\"\",IF(Z54=\"\",\"\",Z54*$E$3))","v":""}]
[50,{"$nulls":24},{"$f":"IF(SUM(AB55:AS55)=0,\"\",SUM(AB55:AS55))","v":""},null,{"$f":"IF(H$3=\"\",\"\",IF(AND($B55=\"Y\",$C55=\"Y\",$G55=\"Y\",H55=H$3),1,\"\"))","v":""},{"$f":"IF(I$3=\"\",\"\",IF(AND($B55=\"Y\",$C55=\"Y\",$G55=\"Y\",I55=I$3),1,\"\"))","v":""},{"$f":"IF(J$3=\"\",\"\",IF(AND($B55=\"Y\",$C55=\"Y\",$G55=\"Y\",J55=J$3),1,\"\"))","v":""},{"$f":"IF(K$3=\"\",\"\",IF(AND($B55=\"Y\",$C55=\"Y\",$G55=\"Y\",K55=K$3),1,\"\"))","v":""},{"$f":"IF(L$3=\"\",\"\",IF(AND($B55=\"Y\",$C55=\"Y\",$G55=\"Y\",L55=L$3),1,\"\"))","v":""},{"$f":"IF(M$3=\"\",\"\",IF(AND($B55=\"Y\",$C55=\"Y\",$G55=\"Y\",M55=M$3),1,\"\"))","v":""},{"$f":"IF(N$3=\"\",\"\",IF(AND($B55=\"Y\",$C55=\"Y\",$G55=\"Y\",N55=N$3),1,\"\"))","v":""},{"$f":"IF(O$3=\"\",\"\",IF(AND($B55=\"Y\",$C55=\"Y\",$G55=\"Y\",O55=O$3),1,\"\"))","v":""},{"$f":"IF(P$3=\"\",\"\",IF(AND($B55=\"Y\",$C55=\"Y\",$G55=\"Y\",P55=P$3),1,\"\"))","v":""},{"$f":"IF(Q$3=\"\",\"\",IF(AND($B55=\"Y\",$C55=\"Y\",$G55=\"Y\",Q55=Q$3),1,\"\"))","v":""},{"$f":"IF(R$3=\"\",\"\",IF(AND($B55=\"Y\",$C55=\"Y\",$G55=\"Y\",R55=R$3),1,\"\"))","v":""},{"$f":"IF(S$3=\"\",\"\",IF(AND($B55=\"Y\",$C55=\"Y\",$G55=\"Y\",S55=S$3),1,\"\"))","v":""},{"$f":"IF(T$3=\"\",\"\",IF(AND($B55=\"Y\",$C55=\"Y\",$G55=\"Y\",T55=T$3),1,\"\"))","v":""},{"$f":"IF(U$3=\"\",\"\",IF(AND($B55=\"Y\",$C55=\"Y\",$G55=\"Y\",U55=U$3),1,\"\"))","v":""},{"$f":"IF(V$3=\"\",\"\",IF(AND($B55=\"Y\",$C55=\"Y\",$G55=\"Y\",V55=V$3),1,\"\"))","v":""},{"$f":"IF(W$3=\"\",\"\",IF(AND($B55=\"Y\",$C55=\"Y\",$G55=\"Y\",W55=W$3),1,\"\"))","v":""},{"$f":"IF(X$3=\"\",\"\",IF(AND($B55=\"Y\",$C55=\"Y\",$G55=\"Y\",X55=X$3),1,\"\"))","v":""},{"$f":"IF(Y$3=\"\",\"\",IF(AND($B55=\"Y\",$C55=\"Y\",$G55=\"Y\",Y55=Y$3),1,\"\"))","v":""},{"$f":"IF(B55<>\"Y\",\"\",IF(Z55=\"\",\"\",Z55*$E$3))","v":""}]
[51,{"$nulls":24},{"$f":"IF(SUM(AB56:AS56)=0,\"\",SUM(AB56:AS56))","v":""},null,{"$f":"IF(H$3=\"\",\"\",IF(AND($B56=\"Y\",$C56=\"Y\",$G56=\"Y\",H56=H$3),1,\"\"))","v":""},{"$f":"IF(I$3=\"\",\"\",IF(AND($B56=\"Y\",$C56=\"Y\",$G56=\"Y\",I56=I$3),1,\"\"))","v":""},{"$f":"IF(J$3=\"\",\"\",IF(AND($B56=\"Y\",$C56=\"Y\",$G56=\"Y\",J56=J$3),1,\"\"))","v":""},{"$f":"IF(K$3=\"\",\"\",IF(AND($B56=\"Y\",$C56=\"Y\",$G56=\"Y\",K56=K$3),1,\"\"))","v":""},{"$f":"IF(L$3=\"\",\"\",IF(AND($B56=\"Y\",$C56=\"Y\",$G56=\"Y\",L56=L$3),1,\"\"))","v":""},{"$f":"IF(M$3=\"\",\"\",IF(AND($B56=\"Y\",$C56=\"Y\",$G56=\"Y\",M56=M$3),1,\"\"))","v":""},{"$f":"IF(N$3=\"\",\"\",IF(AND($B56=\"Y\",$C56=\"Y\",$G56=\"Y\",N56=N$3),1,\"\"))","v":""},{"$f":"IF(O$3=\"\",\"\",IF(AND($B56=\"Y\",$C56=\"Y\",$G56=\"Y\",O56=O$3),1,\"\"))","v":""},{"$f":"IF(P$3=\"\",\"\",IF(AND($B56=\"Y\",$C56=\"Y\",$G56=\"Y\",P56=P$3),1,\"\"))","v":""},{"$f":"IF(Q$3=\"\",\"\",IF(AND($B56=\"Y\",$C56=\"Y\",$G56=\"Y\",Q56=Q$3),1,\"\"))","v":""},{"$f":"IF(R$3=\"\",\"\",IF(AND($B56=\"Y\",$C56=\"Y\",$G56=\"Y\",R56=R$3),1,\"\"))","v":""},{"$f":"IF(S$3=\"\",\"\",IF(AND($B56=\"Y\",$C56=\"Y\",$G56=\"Y\",S56=S$3),1,\"\"))","v":""},{"$f":"IF(T$3=\"\",\"\",IF(AND($B56=\"Y\",$C56=\"Y\",$G56=\"Y\",T56=T$3),1,\"\"))","v":""},{"$f":"IF(U$3=\"\",\"\",IF(AND($B56=\"Y\",$C56=\"Y\",$G56=\"Y\",U56=U$3),1,\"\"))","v":""},{"$f":"IF(V$3=\"\",\"\",IF(AND($B56=\"Y\",$C56=\"Y\",$G56=\"Y\",V56=V$3),1,\"\"))","v":""},{"$f":"IF(W$3=\"\",\"\",IF(AND($B56=\"Y\",$C56=\"Y\",$G56=\"Y\",W56=W$3),1,\"\"))","v":""},{"$f":"IF(X$3=\"\",\"\",IF(AND($B56=\"Y\",$C56=\"Y\",$G56=\"Y\",X56=X$3),1,\"\"))","v":""},{"$f":"IF(Y$3=\"\",\"\",IF(AND($B56=\"Y\",$C56=\"Y\",$G56=\"Y\",Y56=Y$3),1,\"\"))","v":""},{"$f":"IF(B56<>\"Y\",\"\",IF(Z56=\"\",\"\",Z56*$E$3))","v":""}]
[52,{"$nulls":24},{"$f":"IF(SUM(AB57:AS57)=0,\"\",SUM(AB57:AS57))","v":""},null,{"$f":"IF(H$3=\"\",\"\",IF(AND($B57=\"Y\",$C57=\"Y\",$G57=\"Y\",H57=H$3),1,\"\"))","v":""},{"$f":"IF(I$3=\"\",\"\",IF(AND($B57=\"Y\",$C57=\"Y\",$G57=\"Y\",I57=I$3),1,\"\"))","v":""},{"$f":"IF(J$3=\"\",\"\",IF(AND($B57=\"Y\",$C57=\"Y\",$G57=\"Y\",J57=J$3),1,\"\"))","v":""},{"$f":"IF(K$3=\"\",\"\",IF(AND($B57=\"Y\",$C57=\"Y\",$G57=\"Y\",K57=K$3),1,\"\"))","v":""},{"$f":"IF(L$3=\"\",\"\",IF(AND($B57=\"Y\",$C57=\"Y\",$G57=\"Y\",L57=L$3),1,\"\"))","v":""},{"$f":"IF(M$3=\"\",\"\",IF(AND($B57=\"Y\",$C57=\"Y\",$G57=\"Y\",M57=M$3),1,\"\"))","v":""},{"$f":"IF(N$3=\"\",\"\",IF(AND($B57=\"Y\",$C57=\"Y\",$G57=\"Y\",N57=N$3),1,\"\"))","v":""},{"$f":"IF(O$3=\"\",\"\",IF(AND($B57=\"Y\",$C57=\"Y\",$G57=\"Y\",O57=O$3),1,\"\"))","v":""},{"$f":"IF(P$3=\"\",\"\",IF(AND($B57=\"Y\",$C57=\"Y\",$G57=\"Y\",P57=P$3),1,\"\"))","v":""},{"$f":"IF(Q$3=\"\",\"\",IF(AND($B57=\"Y\",$C57=\"Y\",$G57=\"Y\",Q57=Q$3),1,\"\"))","v":""},{"$f":"IF(R$3=\"\",\"\",IF(AND($B57=\"Y\",$C57=\"Y\",$G57=\"Y\",R57=R$3),1,\"\"))","v":""},{"$f":"IF(S$3=\"\",\"\",IF(AND($B57=\"Y\",$C57=\"Y\",$G57=\"Y\",S57=S$3),1,\"\"))","v":""},{"$f":"IF(T$3=\"\",\"\",IF(AND($B57=\"Y\",$C57=\"Y\",$G57=\"Y\",T57=T$3),1,\"\"))","v":""},{"$f":"IF(U$3=\"\",\"\",IF(AND($B57=\"Y\",$C57=\"Y\",$G57=\"Y\",U57=U$3),1,\"\"))","v":""},{"$f":"IF(V$3=\"\",\"\",IF(AND($B57=\"Y\",$C57=\"Y\",$G57=\"Y\",V57=V$3),1,\"\"))","v":""},{"$f":"IF(W$3=\"\",\"\",IF(AND($B57=\"Y\",$C57=\"Y\",$G57=\"Y\",W57=W$3),1,\"\"))","v":""},{"$f":"IF(X$3=\"\",\"\",IF(AND($B57=\"Y\",$C57=\"Y\",$G57=\"Y\",X57=X$3),1,\"\"))","v":""},{"$f":"IF(Y$3=\"\",\"\",IF(AND($B57=\"Y\",$C57=\"Y\",$G57=\"Y\",Y57=Y$3),1,\"\"))","v":""},{"$f":"IF(B57<>\"Y\",\"\",IF(Z57=\"\",\"\",Z57*$E$3))","v":""}]
[53,{"$nulls":24},{"$f":"IF(SUM(AB58:AS58)=0,\"\",SUM(AB58:AS58))","v":""},null,{"$f":"IF(H$3=\"\",\"\",IF(AND($B58=\"Y\",$C58=\"Y\",$G58=\"Y\",H58=H$3),1,\"\"))","v":""},{"$f":"IF(I$3=\"\",\"\",IF(AND($B58=\"Y\",$C58=\"Y\",$G58=\"Y\",I58=I$3),1,\"\"))","v":""},{"$f":"IF(J$3=\"\",\"\",IF(AND($B58=\"Y\",$C58=\"Y\",$G58=\"Y\",J58=J$3),1,\"\"))","v":""},{"$f":"IF(K$3=\"\",\"\",IF(AND($B58=\"Y\",$C58=\"Y\",$G58=\"Y\",K58=K$3),1,\"\"))","v":""},{"$f":"IF(L$3=\"\",\"\",IF(AND($B58=\"Y\",$C58=\"Y\",$G58=\"Y\",L58=L$3),1,\"\"))","v":""},{"$f":"IF(M$3=\"\",\"\",IF(AND($B58=\"Y\",$C58=\"Y\",$G58=\"Y\",M58=M$3),1,\"\"))","v":""},{"$f":"IF(N$3=\"\",\"\",IF(AND($B58=\"Y\",$C58=\"Y\",$G58=\"Y\",N58=N$3),1,\"\"))","v":""},{"$f":"IF(O$3=\"\",\"\",IF(AND($B58=\"Y\",$C58=\"Y\",$G58=\"Y\",O58=O$3),1,\"\"))","v":""},{"$f":"IF(P$3=\"\",\"\",IF(AND($B58=\"Y\",$C58=\"Y\",$G58=\"Y\",P58=P$3),1,\"\"))","v":""},{"$f":"IF(Q$3=\"\",\"\",IF(AND($B58=\"Y\",$C58=\"Y\",$G58=\"Y\",Q58=Q$3),1,\"\"))","v":""},{"$f":"IF(R$3=\"\",\"\",IF(AND($B58=\"Y\",$C58=\"Y\",$G58=\"Y\",R58=R$3),1,\"\"))","v":""},{"$f":"IF(S$3=\"\",\"\",IF(AND($B58=\"Y\",$C58=\"Y\",$G58=\"Y\",S58=S$3),1,\"\"))","v":""},{"$f":"IF(T$3=\"\",\"\",IF(AND($B58=\"Y\",$C58=\"Y\",$G58=\"Y\",T58=T$3),1,\"\"))","v":""},{"$f":"IF(U$3=\"\",\"\",IF(AND($B58=\"Y\",$C58=\"Y\",$G58=\"Y\",U58=U$3),1,\"\"))","v":""},{"$f":"IF(V$3=\"\",\"\",IF(AND($B58=\"Y\",$C58=\"Y\",$G58=\"Y\",V58=V$3),1,\"\"))","v":""},{"$f":"IF(W$3=\"\",\"\",IF(AND($B58=\"Y\",$C58=\"Y\",$G58=\"Y\",W58=W$3),1,\"\"))","v":""},{"$f":"IF(X$3=\"\",\"\",IF(AND($B58=\"Y\",$C58=\"Y\",$G58=\"Y\",X58=X$3),1,\"\"))","v":""},{"$f":"IF(Y$3=\"\",\"\",IF(AND($B58=\"Y\",$C58=\"Y\",$G58=\"Y\",Y58=Y$3),1,\"\"))","v":""},{"$f":"IF(B58<>\"Y\",\"\",IF(Z58=\"\",\"\",Z58*$E$3))","v":""}]
[54,{"$nulls":24},{"$f":"IF(SUM(AB59:AS59)=0,\"\",SUM(AB59:AS59))","v":""},null,{"$f":"IF(H$3=\"\",\"\",IF(AND($B59=\"Y\",$C59=\"Y\",$G59=\"Y\",H59=H$3),1,\"\"))","v":""},{"$f":"IF(I$3=\"\",\"\",IF(AND($B59=\"Y\",$C59=\"Y\",$G59=\"Y\",I59=I$3),1,\"\"))","v":""},{"$f":"IF(J$3=\"\",\"\",IF(AND($B59=\"Y\",$C59=\"Y\",$G59=\"Y\",J59=J$3),1,\"\"))","v":""},{"$f":"IF(K$3=\"\",\"\",IF(AND($B59=\"Y\",$C59=\"Y\",$G59=\"Y\",K59=K$3),1,\"\"))","v":""},{"$f":"IF(L$3=\"\",\"\",IF(AND($B59=\"Y\",$C59=\"Y\",$G59=\"Y\",L59=L$3),1,\"\"))","v":""},{"$f":"IF(M$3=\"\",\"\",IF(AND($B59=\"Y\",$C59=\"Y\",$G59=\"Y\",M59=M$3),1,\"\"))","v":""},{"$f":"IF(N$3=\"\",\"\",IF(AND($B59=\"Y\",$C59=\"Y\",$G59=\"Y\",N59=N$3),1,\"\"))","v":""},{"$f":"IF(O$3=\"\",\"\",IF(AND($B59=\"Y\",$C59=\"Y\",$G59=\"Y\",O59=O$3),1,\"\"))","v":""},{"$f":"IF(P$3=\"\",\"\",IF(AND($B59=\"Y\",$C59=\"Y\",$G59=\"Y\",P59=P$3),1,\"\"))","v":""},{"$f":"IF(Q$3=\"\",\"\",IF(AND($B59=\"Y\",$C59=\"Y\",$G59=\"Y\",Q59=Q$3),1,\"\"))","v":""},{"$f":"IF(R$3=\"\",\"\",IF(AND($B59=\"Y\",$C59=\"Y\",$G59=\"Y\",R59=R$3),1,\"\"))","v":""},{"$f":"IF(S$3=\"\",\"\",IF(AND($B59=\"Y\",$C59=\"Y\",$G59=\"Y\",S59=S$3),1,\"\"))","v":""},{"$f":"IF(T$3=\"\",\"\",IF(AND($B59=\"Y\",$C59=\"Y\",$G59=\"Y\",T59=T$3),1,\"\"))","v":""},{"$f":"IF(U$3=\"\",\"\",IF(AND($B59=\"Y\",$C59=\"Y\",$G59=\"Y\",U59=U$3),1,\"\"))","v":""},{"$f":"IF(V$3=\"\",\"\",IF(AND($B59=\"Y\",$C59=\"Y\",$G59=\"Y\",V59=V$3),1,\"\"))","v":""},{"$f":"IF(W$3=\"\",\"\",IF(AND($B59=\"Y\",$C59=\"Y\",$G59=\"Y\",W59=W$3),1,\"\"))","v":""},{"$f":"IF(X$3=\"\",\"\",IF(AND($B59=\"Y\",$C59=\"Y\",$G59=\"Y\",X59=X$3),1,\"\"))","v":""},{"$f":"IF(Y$3=\"\",\"\",IF(AND($B59=\"Y\",$C59=\"Y\",$G59=\"Y\",Y59=Y$3),1,\"\"))","v":""},{"$f":"IF(B59<>\"Y\",\"\",IF(Z59=\"\",\"\",Z59*$E$3))","v":""}]
[55,{"$nulls":24},{"$f":"IF(SUM(AB60:AS60)=0,\"\",SUM(AB60:AS60))","v":""},null,{"$f":"IF(H$3=\"\",\"\",IF(AND($B60=\"Y\",$C60=\"Y\",$G60=\"Y\",H60=H$3),1,\"\"))","v":""},{"$f":"IF(I$3=\"\",\"\",IF(AND($B60=\"Y\",$C60=\"Y\",$G60=\"Y\",I60=I$3),1,\"\"))","v":""},{"$f":"IF(J$3=\"\",\"\",IF(AND($B60=\"Y\",$C60=\"Y\",$G60=\"Y\",J60=J$3),1,\"\"))","v":""},{"$f":"IF(K$3=\"\",\"\",IF(AND($B60=\"Y\",$C60=\"Y\",$G60=\"Y\",K60=K$3),1,\"\"))","v":""},{"$f":"IF(L$3=\"\",\"\",IF(AND($B60=\"Y\",$C60=\"Y\",$G60=\"Y\",L60=L$3),1,\"\"))","v":""},{"$f":"IF(M$3=\"\",\"\",IF(AND($B60=\"Y\",$C60=\"Y\",$G60=\"Y\",M60=M$3),1,\"\"))","v":""},{"$f":"IF(N$3=\"\",\"\",IF(AND($B60=\"Y\",$C60=\"Y\",$G60=\"Y\",N60=N$3),1,\"\"))","v":""},{"$f":"IF(O$3=\"\",\"\",IF(AND($B60=\"Y\",$C60=\"Y\",$G60=\"Y\",O60=O$3),1,\"\"))","v":""},{"$f":"IF(P$3=\"\",\"\",IF(AND($B60=\"Y\",$C60=\"Y\",$G60=\"Y\",P60=P$3),1,\"\"))","v":""},{"$f":"IF(Q$3=\"\",\"\",IF(AND($B60=\"Y\",$C60=\"Y\",$G60=\"Y\",Q60=Q$3),1,\"\"))","v":""},{"$f":"IF(R$3=\"\",\"\",IF(AND($B60=\"Y\",$C60=\"Y\",$G60=\"Y\",R60=R$3),1,\"\"))","v":""},{"$f":"IF(S$3=\"\",\"\",IF(AND($B60=\"Y\",$C60=\"Y\",$G60=\"Y\",S60=S$3),1,\"\"))","v":""},{"$f":"IF(T$3=\"\",\"\",IF(AND($B60=\"Y\",$C60=\"Y\",$G60=\"Y\",T60=T$3),1,\"\"))","v":""},{"$f":"IF(U$3=\"\",\"\",IF(AND($B60=\"Y\",$C60=\"Y\",$G60=\"Y\",U60=U$3),1,\"\"))","v":""},{"$f":"IF(V$3=\"\",\"\",IF(AND($B60=\"Y\",$C60=\"Y\",$G60=\"Y\",V60=V$3),1,\"\"))","v":""},{"$f":"IF(W$3=\"\",\"\",IF(AND($B60=\"Y\",$C60=\"Y\",$G60=\"Y\",W60=W$3),1,\"\"))","v":""},{"$f":"IF(X$3=\"\",\"\",IF(AND($B60=\"Y\",$C60=\"Y\",$G60=\"Y\",X60=X$3),1,\"\"))","v":""},{"$f":"IF(Y$3=\"\",\"\",IF(AND($B60=\"Y\",$C60=\"Y\",$G60=\"Y\",Y60=Y$3),1,\"\"))","v":""},{"$f":"IF(B60<>\"Y\",\"\",IF(Z60=\"\",\"\",Z60*$E$3))","v":""}]
[56,{"$nulls":24},{"$f":"IF(SUM(AB61:AS61)=0,\"\",SUM(AB61:AS61))","v":""},null,{"$f":"IF(H$3=\"\",\"\",IF(AND($B61=\"Y\",$C61=\"Y\",$G61=\"Y\",H61=H$3),1,\"\"))","v":""},{"$f":"IF(I$3=\"\",\"\",IF(AND($B61=\"Y\",$C61=\"Y\",$G61=\"Y\",I61=I$3),1,\"\"))","v":""},{"$f":"IF(J$3=\"\",\"\",IF(AND($B61=\"Y\",$C61=\"Y\",$G61=\"Y\",J61=J$3),1,\"\"))","v":""},{"$f":"IF(K$3=\"\",\"\",IF(AND($B61=\"Y\",$C61=\"Y\",$G61=\"Y\",K61=K$3),1,\"\"))","v":""},{"$f":"IF(L$3=\"\",\"\",IF(AND($B61=\"Y\",$C61=\"Y\",$G61=\"Y\",L61=L$3),1,\"\"))","v":""},{"$f":"IF(M$3=\"\",\"\",IF(AND($B61=\"Y\",$C61=\"Y\",$G61=\"Y\",M61=M$3),1,\"\"))","v":""},{"$f":"IF(N$3=\"\",\"\",IF(AND($B61=\"Y\",$C61=\"Y\",$G61=\"Y\",N61=N$3),1,\"\"))","v":""},{"$f":"IF(O$3=\"\",\"\",IF(AND($B61=\"Y\",$C61=\"Y\",$G61=\"Y\",O61=O$3),1,\"\"))","v":""},{"$f":"IF(P$3=\"\",\"\",IF(AND($B61=\"Y\",$C61=\"Y\",$G61=\"Y\",P61=P$3),1,\"\"))","v":""},{"$f":"IF(Q$3=\"\",\"\",IF(AND($B61=\"Y\",$C61=\"Y\",$G61=\"Y\",Q61=Q$3),1,\"\"))","v":""},{"$f":"IF(R$3=\"\",\"\",IF(AND($B61=\"Y\",$C61=\"Y\",$G61=\"Y\",R61=R$3),1,\"\"))","v":""},{"$f":"IF(S$3=\"\",\"\",IF(AND($B61=\"Y\",$C61=\"Y\",$G61=\"Y\",S61=S$3),1,\"\"))","v":""},{"$f":"IF(T$3=\"\",\"\",IF(AND($B61=\"Y\",$C61=\"Y\",$G61=\"Y\",T61=T$3),1,\"\"))","v":""},{"$f":"IF(U$3=\"\",\"\",IF(AND($B61=\"Y\",$C61=\"Y\",$G61=\"Y\",U61=U$3),1,\"\"))","v":""},{"$f":"IF(V$3=\"\",\"\",IF(AND($B61=\"Y\",$C61=\"Y\",$G61=\"Y\",V61=V$3),1,\"\"))","v":""},{"$f":"IF(W$3=\"\",\"\",IF(AND($B61=\"Y\",$C61=\"Y\",$G61=\"Y\",W61=W$3),1,\"\"))","v":""},{"$f":"IF(X$3=\"\",\"\",IF(AND($B61=\"Y\",$C61=\"Y\",$G61=\"Y\",X61=X$3),1,\"\"))","v":""},{"$f":"IF(Y$3=\"\",\"\",IF(AND($B61=\"Y\",$C61=\"Y\",$G61=\"Y\",Y61=Y$3),1,\"\"))","v":""},{"$f":"IF(B61<>\"Y\",\"\",IF(Z61=\"\",\"\",Z61*$E$3))","v":""}]
[57,{"$nulls":24},{"$f":"IF(SUM(AB62:AS62)=0,\"\",SUM(AB62:AS62))","v":""},null,{"$f":"IF(H$3=\"\",\"\",IF(AND($B62=\"Y\",$C62=\"Y\",$G62=\"Y\",H62=H$3),1,\"\"))","v":""},{"$f":"IF(I$3=\"\",\"\",IF(AND($B62=\"Y\",$C62=\"Y\",$G62=\"Y\",I62=I$3),1,\"\"))","v":""},{"$f":"IF(J$3=\"\",\"\",IF(AND($B62=\"Y\",$C62=\"Y\",$G62=\"Y\",J62=J$3),1,\"\"))","v":""},{"$f":"IF(K$3=\"\",\"\",IF(AND($B62=\"Y\",$C62=\"Y\",$G62=\"Y\",K62=K$3),1,\"\"))","v":""},{"$f":"IF(L$3=\"\",\"\",IF(AND($B62=\"Y\",$C62=\"Y\",$G62=\"Y\",L62=L$3),1,\"\"))","v":""},{"$f":"IF(M$3=\"\",\"\",IF(AND($B62=\"Y\",$C62=\"Y\",$G62=\"Y\",M62=M$3),1,\"\"))","v":""},{"$f":"IF(N$3=\"\",\"\",IF(AND($B62=\"Y\",$C62=\"Y\",$G62=\"Y\",N62=N$3),1,\"\"))","v":""},{"$f":"IF(O$3=\"\",\"\",IF(AND($B62=\"Y\",$C62=\"Y\",$G62=\"Y\",O62=O$3),1,\"\"))","v":""},{"$f":"IF(P$3=\"\",\"\",IF(AND($B62=\"Y\",$C62=\"Y\",$G62=\"Y\",P62=P$3),1,\"\"))","v":""},{"$f":"IF(Q$3=\"\",\"\",IF(AND($B62=\"Y\",$C62=\"Y\",$G62=\"Y\",Q62=Q$3),1,\"\"))","v":""},{"$f":"IF(R$3=\"\",\"\",IF(AND($B62=\"Y\",$C62=\"Y\",$G62=\"Y\",R62=R$3),1,\"\"))","v":""},{"$f":"IF(S$3=\"\",\"\",IF(AND($B62=\"Y\",$C62=\"Y\",$G62=\"Y\",S62=S$3),1,\"\"))","v":""},{"$f":"IF(T$3=\"\",\"\",IF(AND($B62=\"Y\",$C62=\"Y\",$G62=\"Y\",T62=T$3),1,\"\"))","v":""},{"$f":"IF(U$3=\"\",\"\",IF(AND($B62=\"Y\",$C62=\"Y\",$G62=\"Y\",U62=U$3),1,\"\"))","v":""},{"$f":"IF(V$3=\"\",\"\",IF(AND($B62=\"Y\",$C62=\"Y\",$G62=\"Y\",V62=V$3),1,\"\"))","v":""},{"$f":"IF(W$3=\"\",\"\",IF(AND($B62=\"Y\",$C62=\"Y\",$G62=\"Y\",W62=W$3),1,\"\"))","v":""},{"$f":"IF(X$3=\"\",\"\",IF(AND($B62=\"Y\",$C62=\"Y\",$G62=\"Y\",X62=X$3),1,\"\"))","v":""},{"$f":"IF(Y$3=\"\",\"\",IF(AND($B62=\"Y\",$C62=\"Y\",$G62=\"Y\",Y62=Y$3),1,\"\"))","v":""},{"$f":"IF(B62<>\"Y\",\"\",IF(Z62=\"\",\"\",Z62*$E$3))","v":""}]
[58,{"$nulls":24},{"$f":"IF(SUM(AB63:AS63)=0,\"\",SUM(AB63:AS63))","v":""},null,{"$f":"IF(H$3=\"\",\"\",IF(AND($B63=\"Y\",$C63=\"Y\",$G63=\"Y\",H63=H$3),1,\"\"))","v":""},{"$f":"IF(I$3=\"\",\"\",IF(AND($B63=\"Y\",$C63=\"Y\",$G63=\"Y\",I63=I$3),1,\"\"))","v":""},{"$f":"IF(J$3=\"\",\"\",IF(AND($B63=\"Y\",$C63=\"Y\",$G63=\"Y\",J63=J$3),1,\"\"))","v":""},{"$f":"IF(K$3=\"\",\"\",IF(AND($B63=\"Y\",$C63=\"Y\",$G63=\"Y\",K63=K$3),1,\"\"))","v":""},{"$f":"IF(L$3=\"\",\"\",IF(AND($B63=\"Y\",$C63=\"Y\",$G63=\"Y\",L63=L$3),1,\"\"))","v":""},{"$f":"IF(M$3=\"\",\"\",IF(AND($B63=\"Y\",$C63=\"Y\",$G63=\"Y\",M63=M$3),1,\"\"))","v":""},{"$f":"IF(N$3=\"\",\"\",IF(AND($B63=\"Y\",$C63=\"Y\",$G63=\"Y\",N63=N$3),1,\"\"))","v":""},{"$f":"IF(O$3=\"\",\"\",IF(AND($B63=\"Y\",$C63=\"Y\",$G63=\"Y\",O63=O$3),1,\"\"))","v":""},{"$f":"IF(P$3=\"\",\"\",IF(AND($B63=\"Y\",$C63=\"Y\",$G63=\"Y\",P63=P$3),1,\"\"))","v":""},{"$f":"IF(Q$3=\"\",\"\",IF(AND($B63=\"Y\",$C63=\"Y\",$G63=\"Y\",Q63=Q$3),1,\"\"))","v":""},{"$f":"IF(R$3=\"\",\"\",IF(AND($B63=\"Y\",$C63=\"Y\",$G63=\"Y\",R63=R$3),1,\"\"))","v":""},{"$f":"IF(S$3=\"\",\"\",IF(AND($B63=\"Y\",$C63=\"Y\",$G63=\"Y\",S63=S$3),1,\"\"))","v":""},{"$f":"IF(T$3=\"\",\"\",IF(AND($B63=\"Y\",$C63=\"Y\",$G63=\"Y\",T63=T$3),1,\"\"))","v":""},{"$f":"IF(U$3=\"\",\"\",IF(AND($B63=\"Y\",$C63=\"Y\",$G63=\"Y\",U63=U$3),1,\"\"))","v":""},{"$f":"IF(V$3=\"\",\"\",IF(AND($B63=\"Y\",$C63=\"Y\",$G63=\"Y\",V63=V$3),1,\"\"))","v":""},{"$f":"IF(W$3=\"\",\"\",IF(AND($B63=\"Y\",$C63=\"Y\",$G63=\"Y\",W63=W$3),1,\"\"))","v":""},{"$f":"IF(X$3=\"\",\"\",IF(AND($B63=\"Y\",$C63=\"Y\",$G63=\"Y\",X63=X$3),1,\"\"))","v":""},{"$f":"IF(Y$3=\"\",\"\",IF(AND($B63=\"Y\",$C63=\"Y\",$G63=\"Y\",Y63=Y$3),1,\"\"))","v":""},{"$f":"IF(B63<>\"Y\",\"\",IF(Z63=\"\",\"\",Z63*$E$3))","v":""}]
[59,{"$nulls":24},{"$f":"IF(SUM(AB64:AS64)=0,\"\",SUM(AB64:AS64))","v":""},null,{"$f":"IF(H$3=\"\",\"\",IF(AND($B64=\"Y\",$C64=\"Y\",$G64=\"Y\",H64=H$3),1,\"\"))","v":""},{"$f":"IF(I$3=\"\",\"\",IF(AND($B64=\"Y\",$C64=\"Y\",$G64=\"Y\",I64=I$3),1,\"\"))","v":""},{"$f":"IF(J$3=\"\",\"\",IF(AND($B64=\"Y\",$C64=\"Y\",$G64=\"Y\",J64=J$3),1,\"\"))","v":""},{"$f":"IF(K$3=\"\",\"\",IF(AND($B64=\"Y\",$C64=\"Y\",$G64=\"Y\",K64=K$3),1,\"\"))","v":""},{"$f":"IF(L$3=\"\",\"\",IF(AND($B64=\"Y\",$C64=\"Y\",$G64=\"Y\",L64=L$3),1,\"\"))","v":""},{"$f":"IF(M$3=\"\",\"\",IF(AND($B64=\"Y\",$C64=\"Y\",$G64=\"Y\",M64=M$3),1,\"\"))","v":""},{"$f":"IF(N$3=\"\",\"\",IF(AND($B64=\"Y\",$C64=\"Y\",$G64=\"Y\",N64=N$3),1,\"\"))","v":""},{"$f":"IF(O$3=\"\",\"\",IF(AND($B64=\"Y\",$C64=\"Y\",$G64=\"Y\",O64=O$3),1,\"\"))","v":""},{"$f":"IF(P$3=\"\",\"\",IF(AND($B64=\"Y\",$C64=\"Y\",$G64=\"Y\",P64=P$3),1,\"\"))","v":""},{"$f":"IF(Q$3=\"\",\"\",IF(AND($B64=\"Y\",$C64=\"Y\",$G64=\"Y\",Q64=Q$3),1,\"\"))","v":""},{"$f":"IF(R$3=\"\",\"\",IF(AND($B64=\"Y\",$C64=\"Y\",$G64=\"Y\",R64=R$3),1,\"\"))","v":""},{"$f":"IF(S$3=\"\",\"\",IF(AND($B64=\"Y\",$C64=\"Y\",$G64=\"Y\",S64=S$3),1,\"\"))","v":""},{"$f":"IF(T$3=\"\",\"\",IF(AND($B64=\"Y\",$C64=\"Y\",$G64=\"Y\",T64=T$3),1,\"\"))","v":""},{"$f":"IF(U$3=\"\",\"\",IF(AND($B64=\"Y\",$C64=\"Y\",$G64=\"Y\",U64=U$3),1,\"\"))","v":""},{"$f":"IF(V$3=\"\",\"\",IF(AND($B64=\"Y\",$C64=\"Y\",$G64=\"Y\",V64=V$3),1,\"\"))","v":""},{"$f":"IF(W$3=\"\",\"\",IF(AND($B64=\"Y\",$C64=\"Y\",$G64=\"Y\",W64=W$3),1,\"\"))","v":""},{"$f":"IF(X$3=\"\",\"\",IF(AND($B64=\"Y\",$C64=\"Y\",$G64=\"Y\",X64=X$3),1,\"\"))","v":""},{"$f":"IF(Y$3=\"\",\"\",IF(AND($B64=\"Y\",$C64=\"Y\",$G64=\"Y\",Y64=Y$3),1,\"\"))","v":""},{"$f":"IF(B64<>\"Y\",\"\",IF(Z64=\"\",\"\",Z64*$E$3))","v":""}]
[60,{"$nulls":24},{"$f":"IF(SUM(AB65:AS65)=0,\"\",SUM(AB65:AS65))","v":""},null,{"$f":"IF(H$3=\"\",\"\",IF(AND($B65=\"Y\",$C65=\"Y\",$G65=\"Y\",H65=H$3),1,\"\"))","v":""},{"$f":"IF(I$3=\"\",\"\",IF(AND($B65=\"Y\",$C65=\"Y\",$G65=\"Y\",I65=I$3),1,\"\"))","v":""},{"$f":"IF(J$3=\"\",\"\",IF(AND($B65=\"Y\",$C65=\"Y\",$G65=\"Y\",J65=J$3),1,\"\"))","v":""},{"$f":"IF(K$3=\"\",\"\",IF(AND($B65=\"Y\",$C65=\"Y\",$G65=\"Y\",K65=K$3),1,\"\"))","v":""},{"$f":"IF(L$3=\"\",\"\",IF(AND($B65=\"Y\",$C65=\"Y\",$G65=\"Y\",L65=L$3),1,\"\"))","v":""},{"$f":"IF(M$3=\"\",\"\",IF(AND($B65=\"Y\",$C65=\"Y\",$G65=\"Y\",M65=M$3),1,\"\"))","v":""},{"$f":"IF(N$3=\"\",\"\",IF(AND($B65=\"Y\",$C65=\"Y\",$G65=\"Y\",N65=N$3),1,\"\"))","v":""},{"$f":"IF(O$3=\"\",\"\",IF(AND($B65=\"Y\",$C65=\"Y\",$G65=\"Y\",O65=O$3),1,\"\"))","v":""},{"$f":"IF(P$3=\"\",\"\",IF(AND($B65=\"Y\",$C65=\"Y\",$G65=\"Y\",P65=P$3),1,\"\"))","v":""},{"$f":"IF(Q$3=\"\",\"\",IF(AND($B65=\"Y\",$C65=\"Y\",$G65=\"Y\",Q65=Q$3),1,\"\"))","v":""},{"$f":"IF(R$3=\"\",\"\",IF(AND($B65=\"Y\",$C65=\"Y\",$G65=\"Y\",R65=R$3),1,\"\"))","v":""},{"$f":"IF(S$3=\"\",\"\",IF(AND($B65=\"Y\",$C65=\"Y\",$G65=\"Y\",S65=S$3),1,\"\"))","v":""},{"$f":"IF(T$3=\"\",\"\",IF(AND($B65=\"Y\",$C65=\"Y\",$G65=\"Y\",T65=T$3),1,\"\"))","v":""},{"$f":"IF(U$3=\"\",\"\",IF(AND($B65=\"Y\",$C65=\"Y\",$G65=\"Y\",U65=U$3),1,\"\"))","v":""},{"$f":"IF(V$3=\"\",\"\",IF(AND($B65=\"Y\",$C65=\"Y\",$G65=\"Y\",V65=V$3),1,\"\"))","v":""},{"$f":"IF(W$3=\"\",\"\",IF(AND($B65=\"Y\",$C65=\"Y\",$G65=\"Y\",W65=W$3),1,\"\"))","v":""},{"$f":"IF(X$3=\"\",\"\",IF(AND($B65=\"Y\",$C65=\"Y\",$G65=\"Y\",X65=X$3),1,\"\"))","v":""},{"$f":"IF(Y$3=\"\",\"\",IF(AND($B65=\"Y\",$C65=\"Y\",$G65=\"Y\",Y65=Y$3),1,\"\"))","v":""},{"$f":"IF(B65<>\"Y\",\"\",IF(Z65=\"\",\"\",Z65*$E$3))","v":""}]
[61,{"$nulls":24},{"$f":"IF(SUM(AB66:AS66)=0,\"\",SUM(AB66:AS66))","v":""},null,{"$f":"IF(H$3=\"\",\"\",IF(AND($B66=\"Y\",$C66=\"Y\",$G66=\"Y\",H66=H$3),1,\"\"))","v":""},{"$f":"IF(I$3=\"\",\"\",IF(AND($B66=\"Y\",$C66=\"Y\",$G66=\"Y\",I66=I$3),1,\"\"))","v":""},{"$f":"IF(J$3=\"\",\"\",IF(AND($B66=\"Y\",$C66=\"Y\",$G66=\"Y\",J66=J$3),1,\"\"))","v":""},{"$f":"IF(K$3=\"\",\"\",IF(AND($B66=\"Y\",$C66=\"Y\",$G66=\"Y\",K66=K$3),1,\"\"))","v":""},{"$f":"IF(L$3=\"\",\"\",IF(AND($B66=\"Y\",$C66=\"Y\",$G66=\"Y\",L66=L$3),1,\"\"))","v":""},{"$f":"IF(M$3=\"\",\"\",IF(AND($B66=\"Y\",$C66=\"Y\",$G66=\"Y\",M66=M$3),1,\"\"))","v":""},{"$f":"IF(N$3=\"\",\"\",IF(AND($B66=\"Y\",$C66=\"Y\",$G66=\"Y\",N66=N$3),1,\"\"))","v":""},{"$f":"IF(O$3=\"\",\"\",IF(AND($B66=\"Y\",$C66=\"Y\",$G66=\"Y\",O66=O$3),1,\"\"))","v":""},{"$f":"IF(P$3=\"\",\"\",IF(AND($B66=\"Y\",$C66=\"Y\",$G66=\"Y\",P66=P$3),1,\"\"))","v":""},{"$f":"IF(Q$3=\"\",\"\",IF(AND($B66=\"Y\",$C66=\"Y\",$G66=\"Y\",Q66=Q$3),1,\"\"))","v":""},{"$f":"IF(R$3=\"\",\"\",IF(AND($B66=\"Y\",$C66=\"Y\",$G66=\"Y\",R66=R$3),1,\"\"))","v":""},{"$f":"IF(S$3=\"\",\"\",IF(AND($B66=\"Y\",$C66=\"Y\",$G66=\"Y\",S66=S$3),1,\"\"))","v":""},{"$f":"IF(T$3=\"\",\"\",IF(AND($B66=\"Y\",$C66=\"Y\",$G66=\"Y\",T66=T$3),1,\"\"))","v":""},{"$f":"IF(U$3=\"\",\"\",IF(AND($B66=\"Y\",$C66=\"Y\",$G66=\"Y\",U66=U$3),1,\"\"))","v":""},{"$f":"IF(V$3=\"\",\"\",IF(AND($B66=\"Y\",$C66=\"Y\",$G66=\"Y\",V66=V$3),1,\"\"))","v":""},{"$f":"IF(W$3=\"\",\"\",IF(AND($B66=\"Y\",$C66=\"Y\",$G66=\"Y\",W66=W$3),1,\"\"))","v":""},{"$f":"IF(X$3=\"\",\"\",IF(AND($B66=\"Y\",$C66=\"Y\",$G66=\"Y\",X66=X$3),1,\"\"))","v":""},{"$f":"IF(Y$3=\"\",\"\",IF(AND($B66=\"Y\",$C66=\"Y\",$G66=\"Y\",Y66=Y$3),1,\"\"))","v":""},{"$f":"IF(B66<>\"Y\",\"\",IF(Z66=\"\",\"\",Z66*$E$3))","v":""}]
[62,{"$nulls":24},{"$f":"IF(SUM(AB67:AS67)=0,\"\",SUM(AB67:AS67))","v":""},null,{"$f":"IF(H$3=\"\",\"\",IF(AND($B67=\"Y\",$C67=\"Y\",$G67=\"Y\",H67=H$3),1,\"\"))","v":""},{"$f":"IF(I$3=\"\",\"\",IF(AND($B67=\"Y\",$C67=\"Y\",$G67=\"Y\",I67=I$3),1,\"\"))","v":""},{"$f":"IF(J$3=\"\",\"\",IF(AND($B67=\"Y\",$C67=\"Y\",$G67=\"Y\",J67=J$3),1,\"\"))","v":""},{"$f":"IF(K$3=\"\",\"\",IF(AND($B67=\"Y\",$C67=\"Y\",$G67=\"Y\",K67=K$3),1,\"\"))","v":""},{"$f":"IF(L$3=\"\",\"\",IF(AND($B67=\"Y\",$C67=\"Y\",$G67=\"Y\",L67=L$3),1,\"\"))","v":""},{"$f":"IF(M$3=\"\",\"\",IF(AND($B67=\"Y\",$C67=\"Y\",$G67=\"Y\",M67=M$3),1,\"\"))","v":""},{"$f":"IF(N$3=\"\",\"\",IF(AND($B67=\"Y\",$C67=\"Y\",$G67=\"Y\",N67=N$3),1,\"\"))","v":""},{"$f":"IF(O$3=\"\",\"\",IF(AND($B67=\"Y\",$C67=\"Y\",$G67=\"Y\",O67=O$3),1,\"\"))","v":""},{"$f":"IF(P$3=\"\",\"\",IF(AND($B67=\"Y\",$C67=\"Y\",$G67=\"Y\",P67=P$3),1,\"\"))","v":""},{"$f":"IF(Q$3=\"\",\"\",IF(AND($B67=\"Y\",$C67=\"Y\",$G67=\"Y\",Q67=Q$3),1,\"\"))","v":""},{"$f":"IF(R$3=\"\",\"\",IF(AND($B67=\"Y\",$C67=\"Y\",$G67=\"Y\",R67=R$3),1,\"\"))","v":""},{"$f":"IF(S$3=\"\",\"\",IF(AND($B67=\"Y\",$C67=\"Y\",$G67=\"Y\",S67=S$3),1,\"\"))","v":""},{"$f":"IF(T$3=\"\",\"\",IF(AND($B67=\"Y\",$C67=\"Y\",$G67=\"Y\",T67=T$3),1,\"\"))","v":""},{"$f":"IF(U$3=\"\",\"\",IF(AND($B67=\"Y\",$C67=\"Y\",$G67=\"Y\",U67=U$3),1,\"\"))","v":""},{"$f":"IF(V$3=\"\",\"\",IF(AND($B67=\"Y\",$C67=\"Y\",$G67=\"Y\",V67=V$3),1,\"\"))","v":""},{"$f":"IF(W$3=\"\",\"\",IF(AND($B67=\"Y\",$C67=\"Y\",$G67=\"Y\",W67=W$3),1,\"\"))","v":""},{"$f":"IF(X$3=\"\",\"\",IF(AND($B67=\"Y\",$C67=\"Y\",$G67=\"Y\",X67=X$3),1,\"\"))","v":""},{"$f":"IF(Y$3=\"\",\"\",IF(AND($B67=\"Y\",$C67=\"Y\",$G67=\"Y\",Y67=Y$3),1,\"\"))","v":""},{"$f":"IF(B67<>\"Y\",\"\",IF(Z67=\"\",\"\",Z67*$E$3))","v":""}]
[63,{"$nulls":24},{"$f":"IF(SUM(AB68:AS68)=0,\"\",SUM(AB68:AS68))","v":""},null,{"$f":"IF(H$3=\"\",\"\",IF(AND($B68=\"Y\",$C68=\"Y\",$G68=\"Y\",H68=H$3),1,\"\"))","v":""},{"$f":"IF(I$3=\"\",\"\",IF(AND($B68=\"Y\",$C68=\"Y\",$G68=\"Y\",I68=I$3),1,\"\"))","v":""},{"$f":"IF(J$3=\"\",\"\",IF(AND($B68=\"Y\",$C68=\"Y\",$G68=\"Y\",J68=J$3),1,\"\"))","v":""},{"$f":"IF(K$3=\"\",\"\",IF(AND($B68=\"Y\",$C68=\"Y\",$G68=\"Y\",K68=K$3),1,\"\"))","v":""},{"$f":"IF(L$3=\"\",\"\",IF(AND($B68=\"Y\",$C68=\"Y\",$G68=\"Y\",L68=L$3),1,\"\"))","v":""},{"$f":"IF(M$3=\"\",\"\",IF(AND($B68=\"Y\",$C68=\"Y\",$G68=\"Y\",M68=M$3),1,\"\"))","v":""},{"$f":"IF(N$3=\"\",\"\",IF(AND($B68=\"Y\",$C68=\"Y\",$G68=\"Y\",N68=N$3),1,\"\"))","v":""},{"$f":"IF(O$3=\"\",\"\",IF(AND($B68=\"Y\",$C68=\"Y\",$G68=\"Y\",O68=O$3),1,\"\"))","v":""},{"$f":"IF(P$3=\"\",\"\",IF(AND($B68=\"Y\",$C68=\"Y\",$G68=\"Y\",P68=P$3),1,\"\"))","v":""},{"$f":"IF(Q$3=\"\",\"\",IF(AND($B68=\"Y\",$C68=\"Y\",$G68=\"Y\",Q68=Q$3),1,\"\"))","v":""},{"$f":"IF(R$3=\"\",\"\",IF(AND($B68=\"Y\",$C68=\"Y\",$G68=\"Y\",R68=R$3),1,\"\"))","v":""},{"$f":"IF(S$3=\"\",\"\",IF(AND($B68=\"Y\",$C68=\"Y\",$G68=\"Y\",S68=S$3),1,\"\"))","v":""},{"$f":"IF(T$3=\"\",\"\",IF(AND($B68=\"Y\",$C68=\"Y\",$G68=\"Y\",T68=T$3),1,\"\"))","v":""},{"$f":"IF(U$3=\"\",\"\",IF(AND($B68=\"Y\",$C68=\"Y\",$G68=\"Y\",U68=U$3),1,\"\"))","v":""},{"$f":"IF(V$3=\"\",\"\",IF(AND($B68=\"Y\",$C68=\"Y\",$G68=\"Y\",V68=V$3),1,\"\"))","v":""},{"$f":"IF(W$3=\"\",\"\",IF(AND($B68=\"Y\",$C68=\"Y\",$G68=\"Y\",W68=W$3),1,\"\"))","v":""},{"$f":"IF(X$3=\"\",\"\",IF(AND($B68=\"Y\",$C68=\"Y\",$G68=\"Y\",X68=X$3),1,\"\"))","v":""},{"$f":"IF(Y$3=\"\",\"\",IF(AND($B68=\"Y\",$C68=\"Y\",$G68=\"Y\",Y68=Y$3),1,\"\"))","v":""},{"$f":"IF(B68<>\"Y\",\"\",IF(Z68=\"\",\"\",Z68*$E$3))","v":""}]
[64,{"$nulls":24},{"$f":"IF(SUM(AB69:AS69)=0,\"\",SUM(AB69:AS69))","v":""},null,{"$f":"IF(H$3=\"\",\"\",IF(AND($B69=\"Y\",$C69=\"Y\",$G69=\"Y\",H69=H$3),1,\"\"))","v":""},{"$f":"IF(I$3=\"\",\"\",IF(AND($B69=\"Y\",$C69=\"Y\",$G69=\"Y\",I69=I$3),1,\"\"))","v":""},{"$f":"IF(J$3=\"\",\"\",IF(AND($B69=\"Y\",$C69=\"Y\",$G69=\"Y\",J69=J$3),1,\"\"))","v":""},{"$f":"IF(K$3=\"\",\"\",IF(AND($B69=\"Y\",$C69=\"Y\",$G69=\"Y\",K69=K$3),1,\"\"))","v":""},{"$f":"IF(L$3=\"\",\"\",IF(AND($B69=\"Y\",$C69=\"Y\",$G69=\"Y\",L69=L$3),1,\"\"))","v":""},{"$f":"IF(M$3=\"\",\"\",IF(AND($B69=\"Y\",$C69=\"Y\",$G69=\"Y\",M69=M$3),1,\"\"))","v":""},{"$f":"IF(N$3=\"\",\"\",IF(AND($B69=\"Y\",$C69=\"Y\",$G69=\"Y\",N69=N$3),1,\"\"))","v":""},{"$f":"IF(O$3=\"\",\"\",IF(AND($B69=\"Y\",$C69=\"Y\",$G69=\"Y\",O69=O$3),1,\"\"))","v":""},{"$f":"IF(P$3=\"\",\"\",IF(AND($B69=\"Y\",$C69=\"Y\",$G69=\"Y\",P69=P$3),1,\"\"))","v":""},{"$f":"IF(Q$3=\"\",\"\",IF(AND($B69=\"Y\",$C69=\"Y\",$G69=\"Y\",Q69=Q$3),1,\"\"))","v":""},{"$f":"IF(R$3=\"\",\"\",IF(AND($B69=\"Y\",$C69=\"Y\",$G69=\"Y\",R69=R$3),1,\"\"))","v":""},{"$f":"IF(S$3=\"\",\"\",IF(AND($B69=\"Y\",$C69=\"Y\",$G69=\"Y\",S69=S$3),1,\"\"))","v":""},{"$f":"IF(T$3=\"\",\"\",IF(AND($B69=\"Y\",$C69=\"Y\",$G69=\"Y\",T69=T$3),1,\"\"))","v":""},{"$f":"IF(U$3=\"\",\"\",IF(AND($B69=\"Y\",$C69=\"Y\",$G69=\"Y\",U69=U$3),1,\"\"))","v":""},{"$f":"IF(V$3=\"\",\"\",IF(AND($B69=\"Y\",$C69=\"Y\",$G69=\"Y\",V69=V$3),1,\"\"))","v":""},{"$f":"IF(W$3=\"\",\"\",IF(AND($B69=\"Y\",$C69=\"Y\",$G69=\"Y\",W69=W$3),1,\"\"))","v":""},{"$f":"IF(X$3=\"\",\"\",IF(AND($B69=\"Y\",$C69=\"Y\",$G69=\"Y\",X69=X$3),1,\"\"))","v":""},{"$f":"IF(Y$3=\"\",\"\",IF(AND($B69=\"Y\",$C69=\"Y\",$G69=\"Y\",Y69=Y$3),1,\"\"))","v":""},{"$f":"IF(B69<>\"Y\",\"\",IF(Z69=\"\",\"\",Z69*$E$3))","v":""}]
[65,{"$nulls":24},{"$f":"IF(SUM(AB70:AS70)=0,\"\",SUM(AB70:AS70))","v":""},null,{"$f":"IF(H$3=\"\",\"\",IF(AND($B70=\"Y\",$C70=\"Y\",$G70=\"Y\",H70=H$3),1,\"\"))","v":""},{"$f":"IF(I$3=\"\",\"\",IF(AND($B70=\"Y\",$C70=\"Y\",$G70=\"Y\",I70=I$3),1,\"\"))","v":""},{"$f":"IF(J$3=\"\",\"\",IF(AND($B70=\"Y\",$C70=\"Y\",$G70=\"Y\",J70=J$3),1,\"\"))","v":""},{"$f":"IF(K$3=\"\",\"\",IF(AND($B70=\"Y\",$C70=\"Y\",$G70=\"Y\",K70=K$3),1,\"\"))","v":""},{"$f":"IF(L$3=\"\",\"\",IF(AND($B70=\"Y\",$C70=\"Y\",$G70=\"Y\",L70=L$3),1,\"\"))","v":""},{"$f":"IF(M$3=\"\",\"\",IF(AND($B70=\"Y\",$C70=\"Y\",$G70=\"Y\",M70=M$3),1,\"\"))","v":""},{"$f":"IF(N$3=\"\",\"\",IF(AND($B70=\"Y\",$C70=\"Y\",$G70=\"Y\",N70=N$3),1,\"\"))","v":""},{"$f":"IF(O$3=\"\",\"\",IF(AND($B70=\"Y\",$C70=\"Y\",$G70=\"Y\",O70=O$3),1,\"\"))","v":""},{"$f":"IF(P$3=\"\",\"\",IF(AND($B70=\"Y\",$C70=\"Y\",$G70=\"Y\",P70=P$3),1,\"\"))","v":""},{"$f":"IF(Q$3=\"\",\"\",IF(AND($B70=\"Y\",$C70=\"Y\",$G70=\"Y\",Q70=Q$3),1,\"\"))","v":""},{"$f":"IF(R$3=\"\",\"\",IF(AND($B70=\"Y\",$C70=\"Y\",$G70=\"Y\",R70=R$3),1,\"\"))","v":""},{"$f":"IF(S$3=\"\",\"\",IF(AND($B70=\"Y\",$C70=\"Y\",$G70=\"Y\",S70=S$3),1,\"\"))","v":""},{"$f":"IF(T$3=\"\",\"\",IF(AND($B70=\"Y\",$C70=\"Y\",$G70=\"Y\",T70=T$3),1,\"\"))","v":""},{"$f":"IF(U$3=\"\",\"\",IF(AND($B70=\"Y\",$C70=\"Y\",$G70=\"Y\",U70=U$3),1,\"\"))","v":""},{"$f":"IF(V$3=\"\",\"\",IF(AND($B70=\"Y\",$C70=\"Y\",$G70=\"Y\",V70=V$3),1,\"\"))","v":""},{"$f":"IF(W$3=\"\",\"\",IF(AND($B70=\"Y\",$C70=\"Y\",$G70=\"Y\",W70=W$3),1,\"\"))","v":""},{"$f":"IF(X$3=\"\",\"\",IF(AND($B70=\"Y\",$C70=\"Y\",$G70=\"Y\",X70=X$3),1,\"\"))","v":""},{"$f":"IF(Y$3=\"\",\"\",IF(AND($B70=\"Y\",$C70=\"Y\",$G70=\"Y\",Y70=Y$3),1,\"\"))","v":""},{"$f":"IF(B70<>\"Y\",\"\",IF(Z70=\"\",\"\",Z70*$E$3))","v":""}]
[66,{"$nulls":24},{"$f":"IF(SUM(AB71:AS71)=0,\"\",SUM(AB71:AS71))","v":""},null,{"$f":"IF(H$3=\"\",\"\",IF(AND($B71=\"Y\",$C71=\"Y\",$G71=\"Y\",H71=H$3),1,\"\"))","v":""},{"$f":"IF(I$3=\"\",\"\",IF(AND($B71=\"Y\",$C71=\"Y\",$G71=\"Y\",I71=I$3),1,\"\"))","v":""},{"$f":"IF(J$3=\"\",\"\",IF(AND($B71=\"Y\",$C71=\"Y\",$G71=\"Y\",J71=J$3),1,\"\"))","v":""},{"$f":"IF(K$3=\"\",\"\",IF(AND($B71=\"Y\",$C71=\"Y\",$G71=\"Y\",K71=K$3),1,\"\"))","v":""},{"$f":"IF(L$3=\"\",\"\",IF(AND($B71=\"Y\",$C71=\"Y\",$G71=\"Y\",L71=L$3),1,\"\"))","v":""},{"$f":"IF(M$3=\"\",\"\",IF(AND($B71=\"Y\",$C71=\"Y\",$G71=\"Y\",M71=M$3),1,\"\"))","v":""},{"$f":"IF(N$3=\"\",\"\",IF(AND($B71=\"Y\",$C71=\"Y\",$G71=\"Y\",N71=N$3),1,\"\"))","v":""},{"$f":"IF(O$3=\"\",\"\",IF(AND($B71=\"Y\",$C71=\"Y\",$G71=\"Y\",O71=O$3),1,\"\"))","v":""},{"$f":"IF(P$3=\"\",\"\",IF(AND($B71=\"Y\",$C71=\"Y\",$G71=\"Y\",P71=P$3),1,\"\"))","v":""},{"$f":"IF(Q$3=\"\",\"\",IF(AND($B71=\"Y\",$C71=\"Y\",$G71=\"Y\",Q71=Q$3),1,\"\"))","v":""},{"$f":"IF(R$3=\"\",\"\",IF(AND($B71=\"Y\",$C71=\"Y\",$G71=\"Y\",R71=R$3),1,\"\"))","v":""},{"$f":"IF(S$3=\"\",\"\",IF(AND($B71=\"Y\",$C71=\"Y\",$G71=\"Y\",S71=S$3),1,\"\"))","v":""},{"$f":"IF(T$3=\"\",\"\",IF(AND($B71=\"Y\",$C71=\"Y\",$G71=\"Y\",T71=T$3),1,\"\"))","v":""},{"$f":"IF(U$3=\"\",\"\",IF(AND($B71=\"Y\",$C71=\"Y\",$G71=\"Y\",U71=U$3),1,\"\"))","v":""},{"$f":"IF(V$3=\"\",\"\",IF(AND($B71=\"Y\",$C71=\"Y\",$G71=\"Y\",V71=V$3),1,\"\"))","v":""},{"$f":"IF(W$3=\"\",\"\",IF(AND($B71=\"Y\",$C71=\"Y\",$G71=\"Y\",W71=W$3),1,\"\"))","v":""},{"$f":"IF(X$3=\"\",\"\",IF(AND($B71=\"Y\",$C71=\"Y\",$G71=\"Y\",X71=X$3),1,\"\"))","v":""},{"$f":"IF(Y$3=\"\",\"\",IF(AND($B71=\"Y\",$C71=\"Y\",$G71=\"Y\",Y71=Y$3),1,\"\"))","v":""},{"$f":"IF(B71<>\"Y\",\"\",IF(Z71=\"\",\"\",Z71*$E$3))","v":""}]
[67,{"$nulls":24},{"$f":"IF(SUM(AB72:AS72)=0,\"\",SUM(AB72:AS72))","v":""},null,{"$f":"IF(H$3=\"\",\"\",IF(AND($B72=\"Y\",$C72=\"Y\",$G72=\"Y\",H72=H$3),1,\"\"))","v":""},{"$f":"IF(I$3=\"\",\"\",IF(AND($B72=\"Y\",$C72=\"Y\",$G72=\"Y\",I72=I$3),1,\"\"))","v":""},{"$f":"IF(J$3=\"\",\"\",IF(AND($B72=\"Y\",$C72=\"Y\",$G72=\"Y\",J72=J$3),1,\"\"))","v":""},{"$f":"IF(K$3=\"\",\"\",IF(AND($B72=\"Y\",$C72=\"Y\",$G72=\"Y\",K72=K$3),1,\"\"))","v":""},{"$f":"IF(L$3=\"\",\"\",IF(AND($B72=\"Y\",$C72=\"Y\",$G72=\"Y\",L72=L$3),1,\"\"))","v":""},{"$f":"IF(M$3=\"\",\"\",IF(AND($B72=\"Y\",$C72=\"Y\",$G72=\"Y\",M72=M$3),1,\"\"))","v":""},{"$f":"IF(N$3=\"\",\"\",IF(AND($B72=\"Y\",$C72=\"Y\",$G72=\"Y\",N72=N$3),1,\"\"))","v":""},{"$f":"IF(O$3=\"\",\"\",IF(AND($B72=\"Y\",$C72=\"Y\",$G72=\"Y\",O72=O$3),1,\"\"))","v":""},{"$f":"IF(P$3=\"\",\"\",IF(AND($B72=\"Y\",$C72=\"Y\",$G72=\"Y\",P72=P$3),1,\"\"))","v":""},{"$f":"IF(Q$3=\"\",\"\",IF(AND($B72=\"Y\",$C72=\"Y\",$G72=\"Y\",Q72=Q$3),1,\"\"))","v":""},{"$f":"IF(R$3=\"\",\"\",IF(AND($B72=\"Y\",$C72=\"Y\",$G72=\"Y\",R72=R$3),1,\"\"))","v":""},{"$f":"IF(S$3=\"\",\"\",IF(AND($B72=\"Y\",$C72=\"Y\",$G72=\"Y\",S72=S$3),1,\"\"))","v":""},{"$f":"IF(T$3=\"\",\"\",IF(AND($B72=\"Y\",$C72=\"Y\",$G72=\"Y\",T72=T$3),1,\"\"))","v":""},{"$f":"IF(U$3=\"\",\"\",IF(AND($B72=\"Y\",$C72=\"Y\",$G72=\"Y\",U72=U$3),1,\"\"))","v":""},{"$f":"IF(V$3=\"\",\"\",IF(AND($B72=\"Y\",$C72=\"Y\",$G72=\"Y\",V72=V$3),1,\"\"))","v":""},{"$f":"IF(W$3=\"\",\"\",IF(AND($B72=\"Y\",$C72=\"Y\",$G72=\"Y\",W72=W$3),1,\"\"))","v":""},{"$f":"IF(X$3=\"\",\"\",IF(AND($B72=\"Y\",$C72=\"Y\",$G72=\"Y\",X72=X$3),1,\"\"))","v":""},{"$f":"IF(Y$3=\"\",\"\",IF(AND($B72=\"Y\",$C72=\"Y\",$G72=\"Y\",Y72=Y$3),1,\"\"))","v":""},{"$f":"IF(B72<>\"Y\",\"\",IF(Z72=\"\",\"\",Z72*$E$3))","v":""}]
[68,{"$nulls":24},{"$f":"IF(SUM(AB73:AS73)=0,\"\",SUM(AB73:AS73))","v":""},null,{"$f":"IF(H$3=\"\",\"\",IF(AND($B73=\"Y\",$C73=\"Y\",$G73=\"Y\",H73=H$3),1,\"\"))","v":""},{"$f":"IF(I$3=\"\",\"\",IF(AND($B73=\"Y\",$C73=\"Y\",$G73=\"Y\",I73=I$3),1,\"\"))","v":""},{"$f":"IF(J$3=\"\",\"\",IF(AND($B73=\"Y\",$C73=\"Y\",$G73=\"Y\",J73=J$3),1,\"\"))","v":""},{"$f":"IF(K$3=\"\",\"\",IF(AND($B73=\"Y\",$C73=\"Y\",$G73=\"Y\",K73=K$3),1,\"\"))","v":""},{"$f":"IF(L$3=\"\",\"\",IF(AND($B73=\"Y\",$C73=\"Y\",$G73=\"Y\",L73=L$3),1,\"\"))","v":""},{"$f":"IF(M$3=\"\",\"\",IF(AND($B73=\"Y\",$C73=\"Y\",$G73=\"Y\",M73=M$3),1,\"\"))","v":""},{"$f":"IF(N$3=\"\",\"\",IF(AND($B73=\"Y\",$C73=\"Y\",$G73=\"Y\",N73=N$3),1,\"\"))","v":""},{"$f":"IF(O$3=\"\",\"\",IF(AND($B73=\"Y\",$C73=\"Y\",$G73=\"Y\",O73=O$3),1,\"\"))","v":""},{"$f":"IF(P$3=\"\",\"\",IF(AND($B73=\"Y\",$C73=\"Y\",$G73=\"Y\",P73=P$3),1,\"\"))","v":""},{"$f":"IF(Q$3=\"\",\"\",IF(AND($B73=\"Y\",$C73=\"Y\",$G73=\"Y\",Q73=Q$3),1,\"\"))","v":""},{"$f":"IF(R$3=\"\",\"\",IF(AND($B73=\"Y\",$C73=\"Y\",$G73=\"Y\",R73=R$3),1,\"\"))","v":""},{"$f":"IF(S$3=\"\",\"\",IF(AND($B73=\"Y\",$C73=\"Y\",$G73=\"Y\",S73=S$3),1,\"\"))","v":""},{"$f":"IF(T$3=\"\",\"\",IF(AND($B73=\"Y\",$C73=\"Y\",$G73=\"Y\",T73=T$3),1,\"\"))","v":""},{"$f":"IF(U$3=\"\",\"\",IF(AND($B73=\"Y\",$C73=\"Y\",$G73=\"Y\",U73=U$3),1,\"\"))","v":""},{"$f":"IF(V$3=\"\",\"\",IF(AND($B73=\"Y\",$C73=\"Y\",$G73=\"Y\",V73=V$3),1,\"\"))","v":""},{"$f":"IF(W$3=\"\",\"\",IF(AND($B73=\"Y\",$C73=\"Y\",$G73=\"Y\",W73=W$3),1,\"\"))","v":""},{"$f":"IF(X$3=\"\",\"\",IF(AND($B73=\"Y\",$C73=\"Y\",$G73=\"Y\",X73=X$3),1,\"\"))","v":""},{"$f":"IF(Y$3=\"\",\"\",IF(AND($B73=\"Y\",$C73=\"Y\",$G73=\"Y\",Y73=Y$3),1,\"\"))","v":""},{"$f":"IF(B73<>\"Y\",\"\",IF(Z73=\"\",\"\",Z73*$E$3))","v":""}]
[69,{"$nulls":24},{"$f":"IF(SUM(AB74:AS74)=0,\"\",SUM(AB74:AS74))","v":""},null,{"$f":"IF(H$3=\"\",\"\",IF(AND($B74=\"Y\",$C74=\"Y\",$G74=\"Y\",H74=H$3),1,\"\"))","v":""},{"$f":"IF(I$3=\"\",\"\",IF(AND($B74=\"Y\",$C74=\"Y\",$G74=\"Y\",I74=I$3),1,\"\"))","v":""},{"$f":"IF(J$3=\"\",\"\",IF(AND($B74=\"Y\",$C74=\"Y\",$G74=\"Y\",J74=J$3),1,\"\"))","v":""},{"$f":"IF(K$3=\"\",\"\",IF(AND($B74=\"Y\",$C74=\"Y\",$G74=\"Y\",K74=K$3),1,\"\"))","v":""},{"$f":"IF(L$3=\"\",\"\",IF(AND($B74=\"Y\",$C74=\"Y\",$G74=\"Y\",L74=L$3),1,\"\"))","v":""},{"$f":"IF(M$3=\"\",\"\",IF(AND($B74=\"Y\",$C74=\"Y\",$G74=\"Y\",M74=M$3),1,\"\"))","v":""},{"$f":"IF(N$3=\"\",\"\",IF(AND($B74=\"Y\",$C74=\"Y\",$G74=\"Y\",N74=N$3),1,\"\"))","v":""},{"$f":"IF(O$3=\"\",\"\",IF(AND($B74=\"Y\",$C74=\"Y\",$G74=\"Y\",O74=O$3),1,\"\"))","v":""},{"$f":"IF(P$3=\"\",\"\",IF(AND($B74=\"Y\",$C74=\"Y\",$G74=\"Y\",P74=P$3),1,\"\"))","v":""},{"$f":"IF(Q$3=\"\",\"\",IF(AND($B74=\"Y\",$C74=\"Y\",$G74=\"Y\",Q74=Q$3),1,\"\"))","v":""},{"$f":"IF(R$3=\"\",\"\",IF(AND($B74=\"Y\",$C74=\"Y\",$G74=\"Y\",R74=R$3),1,\"\"))","v":""},{"$f":"IF(S$3=\"\",\"\",IF(AND($B74=\"Y\",$C74=\"Y\",$G74=\"Y\",S74=S$3),1,\"\"))","v":""},{"$f":"IF(T$3=\"\",\"\",IF(AND($B74=\"Y\",$C74=\"Y\",$G74=\"Y\",T74=T$3),1,\"\"))","v":""},{"$f":"IF(U$3=\"\",\"\",IF(AND($B74=\"Y\",$C74=\"Y\",$G74=\"Y\",U74=U$3),1,\"\"))","v":""},{"$f":"IF(V$3=\"\",\"\",IF(AND($B74=\"Y\",$C74=\"Y\",$G74=\"Y\",V74=V$3),1,\"\"))","v":""},{"$f":"IF(W$3=\"\",\"\",IF(AND($B74=\"Y\",$C74=\"Y\",$G74=\"Y\",W74=W$3),1,\"\"))","v":""},{"$f":"IF(X$3=\"\",\"\",IF(AND($B74=\"Y\",$C74=\"Y\",$G74=\"Y\",X74=X$3),1,\"\"))","v":""},{"$f":"IF(Y$3=\"\",\"\",IF(AND($B74=\"Y\",$C74=\"Y\",$G74=\"Y\",Y74=Y$3),1,\"\"))","v":""},{"$f":"IF(B74<>\"Y\",\"\",IF(Z74=\"\",\"\",Z74*$E$3))","v":""}]
[70,{"$nulls":24},{"$f":"IF(SUM(AB75:AS75)=0,\"\",SUM(AB75:AS75))","v":""},null,{"$f":"IF(H$3=\"\",\"\",IF(AND($B75=\"Y\",$C75=\"Y\",$G75=\"Y\",H75=H$3),1,\"\"))","v":""},{"$f":"IF(I$3=\"\",\"\",IF(AND($B75=\"Y\",$C75=\"Y\",$G75=\"Y\",I75=I$3),1,\"\"))","v":""},{"$f":"IF(J$3=\"\",\"\",IF(AND($B75=\"Y\",$C75=\"Y\",$G75=\"Y\",J75=J$3),1,\"\"))","v":""},{"$f":"IF(K$3=\"\",\"\",IF(AND($B75=\"Y\",$C75=\"Y\",$G75=\"Y\",K75=K$3),1,\"\"))","v":""},{"$f":"IF(L$3=\"\",\"\",IF(AND($B75=\"Y\",$C75=\"Y\",$G75=\"Y\",L75=L$3),1,\"\"))","v":""},{"$f":"IF(M$3=\"\",\"\",IF(AND($B75=\"Y\",$C75=\"Y\",$G75=\"Y\",M75=M$3),1,\"\"))","v":""},{"$f":"IF(N$3=\"\",\"\",IF(AND($B75=\"Y\",$C75=\"Y\",$G75=\"Y\",N75=N$3),1,\"\"))","v":""},{"$f":"IF(O$3=\"\",\"\",IF(AND($B75=\"Y\",$C75=\"Y\",$G75=\"Y\",O75=O$3),1,\"\"))","v":""},{"$f":"IF(P$3=\"\",\"\",IF(AND($B75=\"Y\",$C75=\"Y\",$G75=\"Y\",P75=P$3),1,\"\"))","v":""},{"$f":"IF(Q$3=\"\",\"\",IF(AND($B75=\"Y\",$C75=\"Y\",$G75=\"Y\",Q75=Q$3),1,\"\"))","v":""},{"$f":"IF(R$3=\"\",\"\",IF(AND($B75=\"Y\",$C75=\"Y\",$G75=\"Y\",R75=R$3),1,\"\"))","v":""},{"$f":"IF(S$3=\"\",\"\",IF(AND($B75=\"Y\",$C75=\"Y\",$G75=\"Y\",S75=S$3),1,\"\"))","v":""},{"$f":"IF(T$3=\"\",\"\",IF(AND($B75=\"Y\",$C75=\"Y\",$G75=\"Y\",T75=T$3),1,\"\"))","v":""},{"$f":"IF(U$3=\"\",\"\",IF(AND($B75=\"Y\",$C75=\"Y\",$G75=\"Y\",U75=U$3),1,\"\"))","v":""},{"$f":"IF(V$3=\"\",\"\",IF(AND($B75=\"Y\",$C75=\"Y\",$G75=\"Y\",V75=V$3),1,\"\"))","v":""},{"$f":"IF(W$3=\"\",\"\",IF(AND($B75=\"Y\",$C75=\"Y\",$G75=\"Y\",W75=W$3),1,\"\"))","v":""},{"$f":"IF(X$3=\"\",\"\",IF(AND($B75=\"Y\",$C75=\"Y\",$G75=\"Y\",X75=X$3),1,\"\"))","v":""},{"$f":"IF(Y$3=\"\",\"\",IF(AND($B75=\"Y\",$C75=\"Y\",$G75=\"Y\",Y75=Y$3),1,\"\"))","v":""},{"$f":"IF(B75<>\"Y\",\"\",IF(Z75=\"\",\"\",Z75*$E$3))","v":""}]
[71,{"$nulls":24},{"$f":"IF(SUM(AB76:AS76)=0,\"\",SUM(AB76:AS76))","v":""},null,{"$f":"IF(H$3=\"\",\"\",IF(AND($B76=\"Y\",$C76=\"Y\",$G76=\"Y\",H76=H$3),1,\"\"))","v":""},{"$f":"IF(I$3=\"\",\"\",IF(AND($B76=\"Y\",$C76=\"Y\",$G76=\"Y\",I76=I$3),1,\"\"))","v":""},{"$f":"IF(J$3=\"\",\"\",IF(AND($B76=\"Y\",$C76=\"Y\",$G76=\"Y\",J76=J$3),1,\"\"))","v":""},{"$f":"IF(K$3=\"\",\"\",IF(AND($B76=\"Y\",$C76=\"Y\",$G76=\"Y\",K76=K$3),1,\"\"))","v":""},{"$f":"IF(L$3=\"\",\"\",IF(AND($B76=\"Y\",$C76=\"Y\",$G76=\"Y\",L76=L$3),1,\"\"))","v":""},{"$f":"IF(M$3=\"\",\"\",IF(AND($B76=\"Y\",$C76=\"Y\",$G76=\"Y\",M76=M$3),1,\"\"))","v":""},{"$f":"IF(N$3=\"\",\"\",IF(AND($B76=\"Y\",$C76=\"Y\",$G76=\"Y\",N76=N$3),1,\"\"))","v":""},{"$f":"IF(O$3=\"\",\"\",IF(AND($B76=\"Y\",$C76=\"Y\",$G76=\"Y\",O76=O$3),1,\"\"))","v":""},{"$f":"IF(P$3=\"\",\"\",IF(AND($B76=\"Y\",$C76=\"Y\",$G76=\"Y\",P76=P$3),1,\"\"))","v":""},{"$f":"IF(Q$3=\"\",\"\",IF(AND($B76=\"Y\",$C76=\"Y\",$G76=\"Y\",Q76=Q$3),1,\"\"))","v":""},{"$f":"IF(R$3=\"\",\"\",IF(AND($B76=\"Y\",$C76=\"Y\",$G76=\"Y\",R76=R$3),1,\"\"))","v":""},{"$f":"IF(S$3=\"\",\"\",IF(AND($B76=\"Y\",$C76=\"Y\",$G76=\"Y\",S76=S$3),1,\"\"))","v":""},{"$f":"IF(T$3=\"\",\"\",IF(AND($B76=\"Y\",$C76=\"Y\",$G76=\"Y\",T76=T$3),1,\"\"))","v":""},{"$f":"IF(U$3=\"\",\"\",IF(AND($B76=\"Y\",$C76=\"Y\",$G76=\"Y\",U76=U$3),1,\"\"))","v":""},{"$f":"IF(V$3=\"\",\"\",IF(AND($B76=\"Y\",$C76=\"Y\",$G76=\"Y\",V76=V$3),1,\"\"))","v":""},{"$f":"IF(W$3=\"\",\"\",IF(AND($B76=\"Y\",$C76=\"Y\",$G76=\"Y\",W76=W$3),1,\"\"))","v":""},{"$f":"IF(X$3=\"\",\"\",IF(AND($B76=\"Y\",$C76=\"Y\",$G76=\"Y\",X76=X$3),1,\"\"))","v":""},{"$f":"IF(Y$3=\"\",\"\",IF(AND($B76=\"Y\",$C76=\"Y\",$G76=\"Y\",Y76=Y$3),1,\"\"))","v":""},{"$f":"IF(B76<>\"Y\",\"\",IF(Z76=\"\",\"\",Z76*$E$3))","v":""}]
[72,{"$nulls":24},{"$f":"IF(SUM(AB77:AS77)=0,\"\",SUM(AB77:AS77))","v":""},null,{"$f":"IF(H$3=\"\",\"\",IF(AND($B77=\"Y\",$C77=\"Y\",$G77=\"Y\",H77=H$3),1,\"\"))","v":""},{"$f":"IF(I$3=\"\",\"\",IF(AND($B77=\"Y\",$C77=\"Y\",$G77=\"Y\",I77=I$3),1,\"\"))","v":""},{"$f":"IF(J$3=\"\",\"\",IF(AND($B77=\"Y\",$C77=\"Y\",$G77=\"Y\",J77=J$3),1,\"\"))","v":""},{"$f":"IF(K$3=\"\",\"\",IF(AND($B77=\"Y\",$C77=\"Y\",$G77=\"Y\",K77=K$3),1,\"\"))","v":""},{"$f":"IF(L$3=\"\",\"\",IF(AND($B77=\"Y\",$C77=\"Y\",$G77=\"Y\",L77=L$3),1,\"\"))","v":""},{"$f":"IF(M$3=\"\",\"\",IF(AND($B77=\"Y\",$C77=\"Y\",$G77=\"Y\",M77=M$3),1,\"\"))","v":""},{"$f":"IF(N$3=\"\",\"\",IF(AND($B77=\"Y\",$C77=\"Y\",$G77=\"Y\",N77=N$3),1,\"\"))","v":""},{"$f":"IF(O$3=\"\",\"\",IF(AND($B77=\"Y\",$C77=\"Y\",$G77=\"Y\",O77=O$3),1,\"\"))","v":""},{"$f":"IF(P$3=\"\",\"\",IF(AND($B77=\"Y\",$C77=\"Y\",$G77=\"Y\",P77=P$3),1,\"\"))","v":""},{"$f":"IF(Q$3=\"\",\"\",IF(AND($B77=\"Y\",$C77=\"Y\",$G77=\"Y\",Q77=Q$3),1,\"\"))","v":""},{"$f":"IF(R$3=\"\",\"\",IF(AND($B77=\"Y\",$C77=\"Y\",$G77=\"Y\",R77=R$3),1,\"\"))","v":""},{"$f":"IF(S$3=\"\",\"\",IF(AND($B77=\"Y\",$C77=\"Y\",$G77=\"Y\",S77=S$3),1,\"\"))","v":""},{"$f":"IF(T$3=\"\",\"\",IF(AND($B77=\"Y\",$C77=\"Y\",$G77=\"Y\",T77=T$3),1,\"\"))","v":""},{"$f":"IF(U$3=\"\",\"\",IF(AND($B77=\"Y\",$C77=\"Y\",$G77=\"Y\",U77=U$3),1,\"\"))","v":""},{"$f":"IF(V$3=\"\",\"\",IF(AND($B77=\"Y\",$C77=\"Y\",$G77=\"Y\",V77=V$3),1,\"\"))","v":""},{"$f":"IF(W$3=\"\",\"\",IF(AND($B77=\"Y\",$C77=\"Y\",$G77=\"Y\",W77=W$3),1,\"\"))","v":""},{"$f":"IF(X$3=\"\",\"\",IF(AND($B77=\"Y\",$C77=\"Y\",$G77=\"Y\",X77=X$3),1,\"\"))","v":""},{"$f":"IF(Y$3=\"\",\"\",IF(AND($B77=\"Y\",$C77=\"Y\",$G77=\"Y\",Y77=Y$3),1,\"\"))","v":""},{"$f":"IF(B77<>\"Y\",\"\",IF(Z77=\"\",\"\",Z77*$E$3))","v":""}]
[73,{"$nulls":24},{"$f":"IF(SUM(AB78:AS78)=0,\"\",SUM(AB78:AS78))","v":""},null,{"$f":"IF(H$3=\"\",\"\",IF(AND($B78=\"Y\",$C78=\"Y\",$G78=\"Y\",H78=H$3),1,\"\"))","v":""},{"$f":"IF(I$3=\"\",\"\",IF(AND($B78=\"Y\",$C78=\"Y\",$G78=\"Y\",I78=I$3),1,\"\"))","v":""},{"$f":"IF(J$3=\"\",\"\",IF(AND($B78=\"Y\",$C78=\"Y\",$G78=\"Y\",J78=J$3),1,\"\"))","v":""},{"$f":"IF(K$3=\"\",\"\",IF(AND($B78=\"Y\",$C78=\"Y\",$G78=\"Y\",K78=K$3),1,\"\"))","v":""},{"$f":"IF(L$3=\"\",\"\",IF(AND($B78=\"Y\",$C78=\"Y\",$G78=\"Y\",L78=L$3),1,\"\"))","v":""},{"$f":"IF(M$3=\"\",\"\",IF(AND($B78=\"Y\",$C78=\"Y\",$G78=\"Y\",M78=M$3),1,\"\"))","v":""},{"$f":"IF(N$3=\"\",\"\",IF(AND($B78=\"Y\",$C78=\"Y\",$G78=\"Y\",N78=N$3),1,\"\"))","v":""},{"$f":"IF(O$3=\"\",\"\",IF(AND($B78=\"Y\",$C78=\"Y\",$G78=\"Y\",O78=O$3),1,\"\"))","v":""},{"$f":"IF(P$3=\"\",\"\",IF(AND($B78=\"Y\",$C78=\"Y\",$G78=\"Y\",P78=P$3),1,\"\"))","v":""},{"$f":"IF(Q$3=\"\",\"\",IF(AND($B78=\"Y\",$C78=\"Y\",$G78=\"Y\",Q78=Q$3),1,\"\"))","v":""},{"$f":"IF(R$3=\"\",\"\",IF(AND($B78=\"Y\",$C78=\"Y\",$G78=\"Y\",R78=R$3),1,\"\"))","v":""},{"$f":"IF(S$3=\"\",\"\",IF(AND($B78=\"Y\",$C78=\"Y\",$G78=\"Y\",S78=S$3),1,\"\"))","v":""},{"$f":"IF(T$3=\"\",\"\",IF(AND($B78=\"Y\",$C78=\"Y\",$G78=\"Y\",T78=T$3),1,\"\"))","v":""},{"$f":"IF(U$3=\"\",\"\",IF(AND($B78=\"Y\",$C78=\"Y\",$G78=\"Y\",U78=U$3),1,\"\"))","v":""},{"$f":"IF(V$3=\"\",\"\",IF(AND($B78=\"Y\",$C78=\"Y\",$G78=\"Y\",V78=V$3),1,\"\"))","v":""},{"$f":"IF(W$3=\"\",\"\",IF(AND($B78=\"Y\",$C78=\"Y\",$G78=\"Y\",W78=W$3),1,\"\"))","v":""},{"$f":"IF(X$3=\"\",\"\",IF(AND($B78=\"Y\",$C78=\"Y\",$G78=\"Y\",X78=X$3),1,\"\"))","v":""},{"$f":"IF(Y$3=\"\",\"\",IF(AND($B78=\"Y\",$C78=\"Y\",$G78=\"Y\",Y78=Y$3),1,\"\"))","v":""},{"$f":"IF(B78<>\"Y\",\"\",IF(Z78=\"\",\"\",Z78*$E$3))","v":""}]
[74,{"$nulls":24},{"$f":"IF(SUM(AB79:AS79)=0,\"\",SUM(AB79:AS79))","v":""},null,{"$f":"IF(H$3=\"\",\"\",IF(AND($B79=\"Y\",$C79=\"Y\",$G79=\"Y\",H79=H$3),1,\"\"))","v":""},{"$f":"IF(I$3=\"\",\"\",IF(AND($B79=\"Y\",$C79=\"Y\",$G79=\"Y\",I79=I$3),1,\"\"))","v":""},{"$f":"IF(J$3=\"\",\"\",IF(AND($B79=\"Y\",$C79=\"Y\",$G79=\"Y\",J79=J$3),1,\"\"))","v":""},{"$f":"IF(K$3=\"\",\"\",IF(AND($B79=\"Y\",$C79=\"Y\",$G79=\"Y\",K79=K$3),1,\"\"))","v":""},{"$f":"IF(L$3=\"\",\"\",IF(AND($B79=\"Y\",$C79=\"Y\",$G79=\"Y\",L79=L$3),1,\"\"))","v":""},{"$f":"IF(M$3=\"\",\"\",IF(AND($B79=\"Y\",$C79=\"Y\",$G79=\"Y\",M79=M$3),1,\"\"))","v":""},{"$f":"IF(N$3=\"\",\"\",IF(AND($B79=\"Y\",$C79=\"Y\",$G79=\"Y\",N79=N$3),1,\"\"))","v":""},{"$f":"IF(O$3=\"\",\"\",IF(AND($B79=\"Y\",$C79=\"Y\",$G79=\"Y\",O79=O$3),1,\"\"))","v":""},{"$f":"IF(P$3=\"\",\"\",IF(AND($B79=\"Y\",$C79=\"Y\",$G79=\"Y\",P79=P$3),1,\"\"))","v":""},{"$f":"IF(Q$3=\"\",\"\",IF(AND($B79=\"Y\",$C79=\"Y\",$G79=\"Y\",Q79=Q$3),1,\"\"))","v":""},{"$f":"IF(R$3=\"\",\"\",IF(AND($B79=\"Y\",$C79=\"Y\",$G79=\"Y\",R79=R$3),1,\"\"))","v":""},{"$f":"IF(S$3=\"\",\"\",IF(AND($B79=\"Y\",$C79=\"Y\",$G79=\"Y\",S79=S$3),1,\"\"))","v":""},{"$f":"IF(T$3=\"\",\"\",IF(AND($B79=\"Y\",$C79=\"Y\",$G79=\"Y\",T79=T$3),1,\"\"))","v":""},{"$f":"IF(U$3=\"\",\"\",IF(AND($B79=\"Y\",$C79=\"Y\",$G79=\"Y\",U79=U$3),1,\"\"))","v":""},{"$f":"IF(V$3=\"\",\"\",IF(AND($B79=\"Y\",$C79=\"Y\",$G79=\"Y\",V79=V$3),1,\"\"))","v":""},{"$f":"IF(W$3=\"\",\"\",IF(AND($B79=\"Y\",$C79=\"Y\",$G79=\"Y\",W79=W$3),1,\"\"))","v":""},{"$f":"IF(X$3=\"\",\"\",IF(AND($B79=\"Y\",$C79=\"Y\",$G79=\"Y\",X79=X$3),1,\"\"))","v":""},{"$f":"IF(Y$3=\"\",\"\",IF(AND($B79=\"Y\",$C79=\"Y\",$G79=\"Y\",Y79=Y$3),1,\"\"))","v":""},{"$f":"IF(B79<>\"Y\",\"\",IF(Z79=\"\",\"\",Z79*$E$3))","v":""}]
[75,{"$nulls":24},{"$f":"IF(SUM(AB80:AS80)=0,\"\",SUM(AB80:AS80))","v":""},null,{"$f":"IF(H$3=\"\",\"\",IF(AND($B80=\"Y\",$C80=\"Y\",$G80=\"Y\",H80=H$3),1,\"\"))","v":""},{"$f":"IF(I$3=\"\",\"\",IF(AND($B80=\"Y\",$C80=\"Y\",$G80=\"Y\",I80=I$3),1,\"\"))","v":""},{"$f":"IF(J$3=\"\",\"\",IF(AND($B80=\"Y\",$C80=\"Y\",$G80=\"Y\",J80=J$3),1,\"\"))","v":""},{"$f":"IF(K$3=\"\",\"\",IF(AND($B80=\"Y\",$C80=\"Y\",$G80=\"Y\",K80=K$3),1,\"\"))","v":""},{"$f":"IF(L$3=\"\",\"\",IF(AND($B80=\"Y\",$C80=\"Y\",$G80=\"Y\",L80=L$3),1,\"\"))","v":""},{"$f":"IF(M$3=\"\",\"\",IF(AND($B80=\"Y\",$C80=\"Y\",$G80=\"Y\",M80=M$3),1,\"\"))","v":""},{"$f":"IF(N$3=\"\",\"\",IF(AND($B80=\"Y\",$C80=\"Y\",$G80=\"Y\",N80=N$3),1,\"\"))","v":""},{"$f":"IF(O$3=\"\",\"\",IF(AND($B80=\"Y\",$C80=\"Y\",$G80=\"Y\",O80=O$3),1,\"\"))","v":""},{"$f":"IF(P$3=\"\",\"\",IF(AND($B80=\"Y\",$C80=\"Y\",$G80=\"Y\",P80=P$3),1,\"\"))","v":""},{"$f":"IF(Q$3=\"\",\"\",IF(AND($B80=\"Y\",$C80=\"Y\",$G80=\"Y\",Q80=Q$3),1,\"\"))","v":""},{"$f":"IF(R$3=\"\",\"\",IF(AND($B80=\"Y\",$C80=\"Y\",$G80=\"Y\",R80=R$3),1,\"\"))","v":""},{"$f":"IF(S$3=\"\",\"\",IF(AND($B80=\"Y\",$C80=\"Y\",$G80=\"Y\",S80=S$3),1,\"\"))","v":""},{"$f":"IF(T$3=\"\",\"\",IF(AND($B80=\"Y\",$C80=\"Y\",$G80=\"Y\",T80=T$3),1,\"\"))","v":""},{"$f":"IF(U$3=\"\",\"\",IF(AND($B80=\"Y\",$C80=\"Y\",$G80=\"Y\",U80=U$3),1,\"\"))","v":""},{"$f":"IF(V$3=\"\",\"\",IF(AND($B80=\"Y\",$C80=\"Y\",$G80=\"Y\",V80=V$3),1,\"\"))","v":""},{"$f":"IF(W$3=\"\",\"\",IF(AND($B80=\"Y\",$C80=\"Y\",$G80=\"Y\",W80=W$3),1,\"\"))","v":""},{"$f":"IF(X$3=\"\",\"\",IF(AND($B80=\"Y\",$C80=\"Y\",$G80=\"Y\",X80=X$3),1,\"\"))","v":""},{"$f":"IF(Y$3=\"\",\"\",IF(AND($B80=\"Y\",$C80=\"Y\",$G80=\"Y\",Y80=Y$3),1,\"\"))","v":""},{"$f":"IF(B80<>\"Y\",\"\",IF(Z80=\"\",\"\",Z80*$E$3))","v":""}]
[76,{"$nulls":24},{"$f":"IF(SUM(AB81:AS81)=0,\"\",SUM(AB81:AS81))","v":""},null,{"$f":"IF(H$3=\"\",\"\",IF(AND($B81=\"Y\",$C81=\"Y\",$G81=\"Y\",H81=H$3),1,\"\"))","v":""},{"$f":"IF(I$3=\"\",\"\",IF(AND($B81=\"Y\",$C81=\"Y\",$G81=\"Y\",I81=I$3),1,\"\"))","v":""},{"$f":"IF(J$3=\"\",\"\",IF(AND($B81=\"Y\",$C81=\"Y\",$G81=\"Y\",J81=J$3),1,\"\"))","v":""},{"$f":"IF(K$3=\"\",\"\",IF(AND($B81=\"Y\",$C81=\"Y\",$G81=\"Y\",K81=K$3),1,\"\"))","v":""},{"$f":"IF(L$3=\"\",\"\",IF(AND($B81=\"Y\",$C81=\"Y\",$G81=\"Y\",L81=L$3),1,\"\"))","v":""},{"$f":"IF(M$3=\"\",\"\",IF(AND($B81=\"Y\",$C81=\"Y\",$G81=\"Y\",M81=M$3),1,\"\"))","v":""},{"$f":"IF(N$3=\"\",\"\",IF(AND($B81=\"Y\",$C81=\"Y\",$G81=\"Y\",N81=N$3),1,\"\"))","v":""},{"$f":"IF(O$3=\"\",\"\",IF(AND($B81=\"Y\",$C81=\"Y\",$G81=\"Y\",O81=O$3),1,\"\"))","v":""},{"$f":"IF(P$3=\"\",\"\",IF(AND($B81=\"Y\",$C81=\"Y\",$G81=\"Y\",P81=P$3),1,\"\"))","v":""},{"$f":"IF(Q$3=\"\",\"\",IF(AND($B81=\"Y\",$C81=\"Y\",$G81=\"Y\",Q81=Q$3),1,\"\"))","v":""},{"$f":"IF(R$3=\"\",\"\",IF(AND($B81=\"Y\",$C81=\"Y\",$G81=\"Y\",R81=R$3),1,\"\"))","v":""},{"$f":"IF(S$3=\"\",\"\",IF(AND($B81=\"Y\",$C81=\"Y\",$G81=\"Y\",S81=S$3),1,\"\"))","v":""},{"$f":"IF(T$3=\"\",\"\",IF(AND($B81=\"Y\",$C81=\"Y\",$G81=\"Y\",T81=T$3),1,\"\"))","v":""},{"$f":"IF(U$3=\"\",\"\",IF(AND($B81=\"Y\",$C81=\"Y\",$G81=\"Y\",U81=U$3),1,\"\"))","v":""},{"$f":"IF(V$3=\"\",\"\",IF(AND($B81=\"Y\",$C81=\"Y\",$G81=\"Y\",V81=V$3),1,\"\"))","v":""},{"$f":"IF(W$3=\"\",\"\",IF(AND($B81=\"Y\",$C81=\"Y\",$G81=\"Y\",W81=W$3),1,\"\"))","v":""},{"$f":"IF(X$3=\"\",\"\",IF(AND($B81=\"Y\",$C81=\"Y\",$G81=\"Y\",X81=X$3),1,\"\"))","v":""},{"$f":"IF(Y$3=\"\",\"\",IF(AND($B81=\"Y\",$C81=\"Y\",$G81=\"Y\",Y81=Y$3),1,\"\"))","v":""},{"$f":"IF(B81<>\"Y\",\"\",IF(Z81=\"\",\"\",Z81*$E$3))","v":""}]
[77,{"$nulls":24},{"$f":"IF(SUM(AB82:AS82)=0,\"\",SUM(AB82:AS82))","v":""},null,{"$f":"IF(H$3=\"\",\"\",IF(AND($B82=\"Y\",$C82=\"Y\",$G82=\"Y\",H82=H$3),1,\"\"))","v":""},{"$f":"IF(I$3=\"\",\"\",IF(AND($B82=\"Y\",$C82=\"Y\",$G82=\"Y\",I82=I$3),1,\"\"))","v":""},{"$f":"IF(J$3=\"\",\"\",IF(AND($B82=\"Y\",$C82=\"Y\",$G82=\"Y\",J82=J$3),1,\"\"))","v":""},{"$f":"IF(K$3=\"\",\"\",IF(AND($B82=\"Y\",$C82=\"Y\",$G82=\"Y\",K82=K$3),1,\"\"))","v":""},{"$f":"IF(L$3=\"\",\"\",IF(AND($B82=\"Y\",$C82=\"Y\",$G82=\"Y\",L82=L$3),1,\"\"))","v":""},{"$f":"IF(M$3=\"\",\"\",IF(AND($B82=\"Y\",$C82=\"Y\",$G82=\"Y\",M82=M$3),1,\"\"))","v":""},{"$f":"IF(N$3=\"\",\"\",IF(AND($B82=\"Y\",$C82=\"Y\",$G82=\"Y\",N82=N$3),1,\"\"))","v":""},{"$f":"IF(O$3=\"\",\"\",IF(AND($B82=\"Y\",$C82=\"Y\",$G82=\"Y\",O82=O$3),1,\"\"))","v":""},{"$f":"IF(P$3=\"\",\"\",IF(AND($B82=\"Y\",$C82=\"Y\",$G82=\"Y\",P82=P$3),1,\"\"))","v":""},{"$f":"IF(Q$3=\"\",\"\",IF(AND($B82=\"Y\",$C82=\"Y\",$G82=\"Y\",Q82=Q$3),1,\"\"))","v":""},{"$f":"IF(R$3=\"\",\"\",IF(AND($B82=\"Y\",$C82=\"Y\",$G82=\"Y\",R82=R$3),1,\"\"))","v":""},{"$f":"IF(S$3=\"\",\"\",IF(AND($B82=\"Y\",$C82=\"Y\",$G82=\"Y\",S82=S$3),1,\"\"))","v":""},{"$f":"IF(T$3=\"\",\"\",IF(AND($B82=\"Y\",$C82=\"Y\",$G82=\"Y\",T82=T$3),1,\"\"))","v":""},{"$f":"IF(U$3=\"\",\"\",IF(AND($B82=\"Y\",$C82=\"Y\",$G82=\"Y\",U82=U$3),1,\"\"))","v":""},{"$f":"IF(V$3=\"\",\"\",IF(AND($B82=\"Y\",$C82=\"Y\",$G82=\"Y\",V82=V$3),1,\"\"))","v":""},{"$f":"IF(W$3=\"\",\"\",IF(AND($B82=\"Y\",$C82=\"Y\",$G82=\"Y\",W82=W$3),1,\"\"))","v":""},{"$f":"IF(X$3=\"\",\"\",IF(AND($B82=\"Y\",$C82=\"Y\",$G82=\"Y\",X82=X$3),1,\"\"))","v":""},{"$f":"IF(Y$3=\"\",\"\",IF(AND($B82=\"Y\",$C82=\"Y\",$G82=\"Y\",Y82=Y$3),1,\"\"))","v":""},{"$f":"IF(B82<>\"Y\",\"\",IF(Z82=\"\",\"\",Z82*$E$3))","v":""}]
[78,{"$nulls":24},{"$f":"IF(SUM(AB83:AS83)=0,\"\",SUM(AB83:AS83))","v":""},null,{"$f":"IF(H$3=\"\",\"\",IF(AND($B83=\"Y\",$C83=\"Y\",$G83=\"Y\",H83=H$3),1,\"\"))","v":""},{"$f":"IF(I$3=\"\",\"\",IF(AND($B83=\"Y\",$C83=\"Y\",$G83=\"Y\",I83=I$3),1,\"\"))","v":""},{"$f":"IF(J$3=\"\",\"\",IF(AND($B83=\"Y\",$C83=\"Y\",$G83=\"Y\",J83=J$3),1,\"\"))","v":""},{"$f":"IF(K$3=\"\",\"\",IF(AND($B83=\"Y\",$C83=\"Y\",$G83=\"Y\",K83=K$3),1,\"\"))","v":""},{"$f":"IF(L$3=\"\",\"\",IF(AND($B83=\"Y\",$C83=\"Y\",$G83=\"Y\",L83=L$3),1,\"\"))","v":""},{"$f":"IF(M$3=\"\",\"\",IF(AND($B83=\"Y\",$C83=\"Y\",$G83=\"Y\",M83=M$3),1,\"\"))","v":""},{"$f":"IF(N$3=\"\",\"\",IF(AND($B83=\"Y\",$C83=\"Y\",$G83=\"Y\",N83=N$3),1,\"\"))","v":""},{"$f":"IF(O$3=\"\",\"\",IF(AND($B83=\"Y\",$C83=\"Y\",$G83=\"Y\",O83=O$3),1,\"\"))","v":""},{"$f":"IF(P$3=\"\",\"\",IF(AND($B83=\"Y\",$C83=\"Y\",$G83=\"Y\",P83=P$3),1,\"\"))","v":""},{"$f":"IF(Q$3=\"\",\"\",IF(AND($B83=\"Y\",$C83=\"Y\",$G83=\"Y\",Q83=Q$3),1,\"\"))","v":""},{"$f":"IF(R$3=\"\",\"\",IF(AND($B83=\"Y\",$C83=\"Y\",$G83=\"Y\",R83=R$3),1,\"\"))","v":""},{"$f":"IF(S$3=\"\",\"\",IF(AND($B83=\"Y\",$C83=\"Y\",$G83=\"Y\",S83=S$3),1,\"\"))","v":""},{"$f":"IF(T$3=\"\",\"\",IF(AND($B83=\"Y\",$C83=\"Y\",$G83=\"Y\",T83=T$3),1,\"\"))","v":""},{"$f":"IF(U$3=\"\",\"\",IF(AND($B83=\"Y\",$C83=\"Y\",$G83=\"Y\",U83=U$3),1,\"\"))","v":""},{"$f":"IF(V$3=\"\",\"\",IF(AND($B83=\"Y\",$C83=\"Y\",$G83=\"Y\",V83=V$3),1,\"\"))","v":""},{"$f":"IF(W$3=\"\",\"\",IF(AND($B83=\"Y\",$C83=\"Y\",$G83=\"Y\",W83=W$3),1,\"\"))","v":""},{"$f":"IF(X$3=\"\",\"\",IF(AND($B83=\"Y\",$C83=\"Y\",$G83=\"Y\",X83=X$3),1,\"\"))","v":""},{"$f":"IF(Y$3=\"\",\"\",IF(AND($B83=\"Y\",$C83=\"Y\",$G83=\"Y\",Y83=Y$3),1,\"\"))","v":""},{"$f":"IF(B83<>\"Y\",\"\",IF(Z83=\"\",\"\",Z83*$E$3))","v":""}]
[79,{"$nulls":24},{"$f":"IF(SUM(AB84:AS84)=0,\"\",SUM(AB84:AS84))","v":""},null,{"$f":"IF(H$3=\"\",\"\",IF(AND($B84=\"Y\",$C84=\"Y\",$G84=\"Y\",H84=H$3),1,\"\"))","v":""},{"$f":"IF(I$3=\"\",\"\",IF(AND($B84=\"Y\",$C84=\"Y\",$G84=\"Y\",I84=I$3),1,\"\"))","v":""},{"$f":"IF(J$3=\"\",\"\",IF(AND($B84=\"Y\",$C84=\"Y\",$G84=\"Y\",J84=J$3),1,\"\"))","v":""},{"$f":"IF(K$3=\"\",\"\",IF(AND($B84=\"Y\",$C84=\"Y\",$G84=\"Y\",K84=K$3),1,\"\"))","v":""},{"$f":"IF(L$3=\"\",\"\",IF(AND($B84=\"Y\",$C84=\"Y\",$G84=\"Y\",L84=L$3),1,\"\"))","v":""},{"$f":"IF(M$3=\"\",\"\",IF(AND($B84=\"Y\",$C84=\"Y\",$G84=\"Y\",M84=M$3),1,\"\"))","v":""},{"$f":"IF(N$3=\"\",\"\",IF(AND($B84=\"Y\",$C84=\"Y\",$G84=\"Y\",N84=N$3),1,\"\"))","v":""},{"$f":"IF(O$3=\"\",\"\",IF(AND($B84=\"Y\",$C84=\"Y\",$G84=\"Y\",O84=O$3),1,\"\"))","v":""},{"$f":"IF(P$3=\"\",\"\",IF(AND($B84=\"Y\",$C84=\"Y\",$G84=\"Y\",P84=P$3),1,\"\"))","v":""},{"$f":"IF(Q$3=\"\",\"\",IF(AND($B84=\"Y\",$C84=\"Y\",$G84=\"Y\",Q84=Q$3),1,\"\"))","v":""},{"$f":"IF(R$3=\"\",\"\",IF(AND($B84=\"Y\",$C84=\"Y\",$G84=\"Y\",R84=R$3),1,\"\"))","v":""},{"$f":"IF(S$3=\"\",\"\",IF(AND($B84=\"Y\",$C84=\"Y\",$G84=\"Y\",S84=S$3),1,\"\"))","v":""},{"$f":"IF(T$3=\"\",\"\",IF(AND($B84=\"Y\",$C84=\"Y\",$G84=\"Y\",T84=T$3),1,\"\"))","v":""},{"$f":"IF(U$3=\"\",\"\",IF(AND($B84=\"Y\",$C84=\"Y\",$G84=\"Y\",U84=U$3),1,\"\"))","v":""},{"$f":"IF(V$3=\"\",\"\",IF(AND($B84=\"Y\",$C84=\"Y\",$G84=\"Y\",V84=V$3),1,\"\"))","v":""},{"$f":"IF(W$3=\"\",\"\",IF(AND($B84=\"Y\",$C84=\"Y\",$G84=\"Y\",W84=W$3),1,\"\"))","v":""},{"$f":"IF(X$3=\"\",\"\",IF(AND($B84=\"Y\",$C84=\"Y\",$G84=\"Y\",X84=X$3),1,\"\"))","v":""},{"$f":"IF(Y$3=\"\",\"\",IF(AND($B84=\"Y\",$C84=\"Y\",$G84=\"Y\",Y84=Y$3),1,\"\"))","v":""},{"$f":"IF(B84<>\"Y\",\"\",IF(Z84=\"\",\"\",Z84*$E$3))","v":""}]
[80,{"$nulls":24},{"$f":"IF(SUM(AB85:AS85)=0,\"\",SUM(AB85:AS85))","v":""},null,{"$f":"IF(H$3=\"\",\"\",IF(AND($B85=\"Y\",$C85=\"Y\",$G85=\"Y\",H85=H$3),1,\"\"))","v":""},{"$f":"IF(I$3=\"\",\"\",IF(AND($B85=\"Y\",$C85=\"Y\",$G85=\"Y\",I85=I$3),1,\"\"))","v":""},{"$f":"IF(J$3=\"\",\"\",IF(AND($B85=\"Y\",$C85=\"Y\",$G85=\"Y\",J85=J$3),1,\"\"))","v":""},{"$f":"IF(K$3=\"\",\"\",IF(AND($B85=\"Y\",$C85=\"Y\",$G85=\"Y\",K85=K$3),1,\"\"))","v":""},{"$f":"IF(L$3=\"\",\"\",IF(AND($B85=\"Y\",$C85=\"Y\",$G85=\"Y\",L85=L$3),1,\"\"))","v":""},{"$f":"IF(M$3=\"\",\"\",IF(AND($B85=\"Y\",$C85=\"Y\",$G85=\"Y\",M85=M$3),1,\"\"))","v":""},{"$f":"IF(N$3=\"\",\"\",IF(AND($B85=\"Y\",$C85=\"Y\",$G85=\"Y\",N85=N$3),1,\"\"))","v":""},{"$f":"IF(O$3=\"\",\"\",IF(AND($B85=\"Y\",$C85=\"Y\",$G85=\"Y\",O85=O$3),1,\"\"))","v":""},{"$f":"IF(P$3=\"\",\"\",IF(AND($B85=\"Y\",$C85=\"Y\",$G85=\"Y\",P85=P$3),1,\"\"))","v":""},{"$f":"IF(Q$3=\"\",\"\",IF(AND($B85=\"Y\",$C85=\"Y\",$G85=\"Y\",Q85=Q$3),1,\"\"))","v":""},{"$f":"IF(R$3=\"\",\"\",IF(AND($B85=\"Y\",$C85=\"Y\",$G85=\"Y\",R85=R$3),1,\"\"))","v":""},{"$f":"IF(S$3=\"\",\"\",IF(AND($B85=\"Y\",$C85=\"Y\",$G85=\"Y\",S85=S$3),1,\"\"))","v":""},{"$f":"IF(T$3=\"\",\"\",IF(AND($B85=\"Y\",$C85=\"Y\",$G85=\"Y\",T85=T$3),1,\"\"))","v":""},{"$f":"IF(U$3=\"\",\"\",IF(AND($B85=\"Y\",$C85=\"Y\",$G85=\"Y\",U85=U$3),1,\"\"))","v":""},{"$f":"IF(V$3=\"\",\"\",IF(AND($B85=\"Y\",$C85=\"Y\",$G85=\"Y\",V85=V$3),1,\"\"))","v":""},{"$f":"IF(W$3=\"\",\"\",IF(AND($B85=\"Y\",$C85=\"Y\",$G85=\"Y\",W85=W$3),1,\"\"))","v":""},{"$f":"IF(X$3=\"\",\"\",IF(AND($B85=\"Y\",$C85=\"Y\",$G85=\"Y\",X85=X$3),1,\"\"))","v":""},{"$f":"IF(Y$3=\"\",\"\",IF(AND($B85=\"Y\",$C85=\"Y\",$G85=\"Y\",Y85=Y$3),1,\"\"))","v":""},{"$f":"IF(B85<>\"Y\",\"\",IF(Z85=\"\",\"\",Z85*$E$3))","v":""}]
[81,{"$nulls":24},{"$f":"IF(SUM(AB86:AS86)=0,\"\",SUM(AB86:AS86))","v":""},null,{"$f":"IF(H$3=\"\",\"\",IF(AND($B86=\"Y\",$C86=\"Y\",$G86=\"Y\",H86=H$3),1,\"\"))","v":""},{"$f":"IF(I$3=\"\",\"\",IF(AND($B86=\"Y\",$C86=\"Y\",$G86=\"Y\",I86=I$3),1,\"\"))","v":""},{"$f":"IF(J$3=\"\",\"\",IF(AND($B86=\"Y\",$C86=\"Y\",$G86=\"Y\",J86=J$3),1,\"\"))","v":""},{"$f":"IF(K$3=\"\",\"\",IF(AND($B86=\"Y\",$C86=\"Y\",$G86=\"Y\",K86=K$3),1,\"\"))","v":""},{"$f":"IF(L$3=\"\",\"\",IF(AND($B86=\"Y\",$C86=\"Y\",$G86=\"Y\",L86=L$3),1,\"\"))","v":""},{"$f":"IF(M$3=\"\",\"\",IF(AND($B86=\"Y\",$C86=\"Y\",$G86=\"Y\",M86=M$3),1,\"\"))","v":""},{"$f":"IF(N$3=\"\",\"\",IF(AND($B86=\"Y\",$C86=\"Y\",$G86=\"Y\",N86=N$3),1,\"\"))","v":""},{"$f":"IF(O$3=\"\",\"\",IF(AND($B86=\"Y\",$C86=\"Y\",$G86=\"Y\",O86=O$3),1,\"\"))","v":""},{"$f":"IF(P$3=\"\",\"\",IF(AND($B86=\"Y\",$C86=\"Y\",$G86=\"Y\",P86=P$3),1,\"\"))","v":""},{"$f":"IF(Q$3=\"\",\"\",IF(AND($B86=\"Y\",$C86=\"Y\",$G86=\"Y\",Q86=Q$3),1,\"\"))","v":""},{"$f":"IF(R$3=\"\",\"\",IF(AND($B86=\"Y\",$C86=\"Y\",$G86=\"Y\",R86=R$3),1,\"\"))","v":""},{"$f":"IF(S$3=\"\",\"\",IF(AND($B86=\"Y\",$C86=\"Y\",$G86=\"Y\",S86=S$3),1,\"\"))","v":""},{"$f":"IF(T$3=\"\",\"\",IF(AND($B86=\"Y\",$C86=\"Y\",$G86=\"Y\",T86=T$3),1,\"\"))","v":""},{"$f":"IF(U$3=\"\",\"\",IF(AND($B86=\"Y\",$C86=\"Y\",$G86=\"Y\",U86=U$3),1,\"\"))","v":""},{"$f":"IF(V$3=\"\",\"\",IF(AND($B86=\"Y\",$C86=\"Y\",$G86=\"Y\",V86=V$3),1,\"\"))","v":""},{"$f":"IF(W$3=\"\",\"\",IF(AND($B86=\"Y\",$C86=\"Y\",$G86=\"Y\",W86=W$3),1,\"\"))","v":""},{"$f":"IF(X$3=\"\",\"\",IF(AND($B86=\"Y\",$C86=\"Y\",$G86=\"Y\",X86=X$3),1,\"\"))","v":""},{"$f":"IF(Y$3=\"\",\"\",IF(AND($B86=\"Y\",$C86=\"Y\",$G86=\"Y\",Y86=Y$3),1,\"\"))","v":""},{"$f":"IF(B86<>\"Y\",\"\",IF(Z86=\"\",\"\",Z86*$E$3))","v":""}]
[82,{"$nulls":24},{"$f":"IF(SUM(AB87:AS87)=0,\"\",SUM(AB87:AS87))","v":""},null,{"$f":"IF(H$3=\"\",\"\",IF(AND($B87=\"Y\",$C87=\"Y\",$G87=\"Y\",H87=H$3),1,\"\"))","v":""},{"$f":"IF(I$3=\"\",\"\",IF(AND($B87=\"Y\",$C87=\"Y\",$G87=\"Y\",I87=I$3),1,\"\"))","v":""},{"$f":"IF(J$3=\"\",\"\",IF(AND($B87=\"Y\",$C87=\"Y\",$G87=\"Y\",J87=J$3),1,\"\"))","v":""},{"$f":"IF(K$3=\"\",\"\",IF(AND($B87=\"Y\",$C87=\"Y\",$G87=\"Y\",K87=K$3),1,\"\"))","v":""},{"$f":"IF(L$3=\"\",\"\",IF(AND($B87=\"Y\",$C87=\"Y\",$G87=\"Y\",L87=L$3),1,\"\"))","v":""},{"$f":"IF(M$3=\"\",\"\",IF(AND($B87=\"Y\",$C87=\"Y\",$G87=\"Y\",M87=M$3),1,\"\"))","v":""},{"$f":"IF(N$3=\"\",\"\",IF(AND($B87=\"Y\",$C87=\"Y\",$G87=\"Y\",N87=N$3),1,\"\"))","v":""},{"$f":"IF(O$3=\"\",\"\",IF(AND($B87=\"Y\",$C87=\"Y\",$G87=\"Y\",O87=O$3),1,\"\"))","v":""},{"$f":"IF(P$3=\"\",\"\",IF(AND($B87=\"Y\",$C87=\"Y\",$G87=\"Y\",P87=P$3),1,\"\"))","v":""},{"$f":"IF(Q$3=\"\",\"\",IF(AND($B87=\"Y\",$C87=\"Y\",$G87=\"Y\",Q87=Q$3),1,\"\"))","v":""},{"$f":"IF(R$3=\"\",\"\",IF(AND($B87=\"Y\",$C87=\"Y\",$G87=\"Y\",R87=R$3),1,\"\"))","v":""},{"$f":"IF(S$3=\"\",\"\",IF(AND($B87=\"Y\",$C87=\"Y\",$G87=\"Y\",S87=S$3),1,\"\"))","v":""},{"$f":"IF(T$3=\"\",\"\",IF(AND($B87=\"Y\",$C87=\"Y\",$G87=\"Y\",T87=T$3),1,\"\"))","v":""},{"$f":"IF(U$3=\"\",\"\",IF(AND($B87=\"Y\",$C87=\"Y\",$G87=\"Y\",U87=U$3),1,\"\"))","v":""},{"$f":"IF(V$3=\"\",\"\",IF(AND($B87=\"Y\",$C87=\"Y\",$G87=\"Y\",V87=V$3),1,\"\"))","v":""},{"$f":"IF(W$3=\"\",\"\",IF(AND($B87=\"Y\",$C87=\"Y\",$G87=\"Y\",W87=W$3),1,\"\"))","v":""},{"$f":"IF(X$3=\"\",\"\",IF(AND($B87=\"Y\",$C87=\"Y\",$G87=\"Y\",X87=X$3),1,\"\"))","v":""},{"$f":"IF(Y$3=\"\",\"\",IF(AND($B87=\"Y\",$C87=\"Y\",$G87=\"Y\",Y87=Y$3),1,\"\"))","v":""},{"$f":"IF(B87<>\"Y\",\"\",IF(Z87=\"\",\"\",Z87*$E$3))","v":""}]
[83,{"$nulls":24},{"$f":"IF(SUM(AB88:AS88)=0,\"\",SUM(AB88:AS88))","v":""},null,{"$f":"IF(H$3=\"\",\"\",IF(AND($B88=\"Y\",$C88=\"Y\",$G88=\"Y\",H88=H$3),1,\"\"))","v":""},{"$f":"IF(I$3=\"\",\"\",IF(AND($B88=\"Y\",$C88=\"Y\",$G88=\"Y\",I88=I$3),1,\"\"))","v":""},{"$f":"IF(J$3=\"\",\"\",IF(AND($B88=\"Y\",$C88=\"Y\",$G88=\"Y\",J88=J$3),1,\"\"))","v":""},{"$f":"IF(K$3=\"\",\"\",IF(AND($B88=\"Y\",$C88=\"Y\",$G88=\"Y\",K88=K$3),1,\"\"))","v":""},{"$f":"IF(L$3=\"\",\"\",IF(AND($B88=\"Y\",$C88=\"Y\",$G88=\"Y\",L88=L$3),1,\"\"))","v":""},{"$f":"IF(M$3=\"\",\"\",IF(AND($B88=\"Y\",$C88=\"Y\",$G88=\"Y\",M88=M$3),1,\"\"))","v":""},{"$f":"IF(N$3=\"\",\"\",IF(AND($B88=\"Y\",$C88=\"Y\",$G88=\"Y\",N88=N$3),1,\"\"))","v":""},{"$f":"IF(O$3=\"\",\"\",IF(AND($B88=\"Y\",$C88=\"Y\",$G88=\"Y\",O88=O$3),1,\"\"))","v":""},{"$f":"IF(P$3=\"\",\"\",IF(AND($B88=\"Y\",$C88=\"Y\",$G88=\"Y\",P88=P$3),1,\"\"))","v":""},{"$f":"IF(Q$3=\"\",\"\",IF(AND($B88=\"Y\",$C88=\"Y\",$G88=\"Y\",Q88=Q$3),1,\"\"))","v":""},{"$f":"IF(R$3=\"\",\"\",IF(AND($B88=\"Y\",$C88=\"Y\",$G88=\"Y\",R88=R$3),1,\"\"))","v":""},{"$f":"IF(S$3=\"\",\"\",IF(AND($B88=\"Y\",$C88=\"Y\",$G88=\"Y\",S88=S$3),1,\"\"))","v":""},{"$f":"IF(T$3=\"\",\"\",IF(AND($B88=\"Y\",$C88=\"Y\",$G88=\"Y\",T88=T$3),1,\"\"))","v":""},{"$f":"IF(U$3=\"\",\"\",IF(AND($B88=\"Y\",$C88=\"Y\",$G88=\"Y\",U88=U$3),1,\"\"))","v":""},{"$f":"IF(V$3=\"\",\"\",IF(AND($B88=\"Y\",$C88=\"Y\",$G88=\"Y\",V88=V$3),1,\"\"))","v":""},{"$f":"IF(W$3=\"\",\"\",IF(AND($B88=\"Y\",$C88=\"Y\",$G88=\"Y\",W88=W$3),1,\"\"))","v":""},{"$f":"IF(X$3=\"\",\"\",IF(AND($B88=\"Y\",$C88=\"Y\",$G88=\"Y\",X88=X$3),1,\"\"))","v":""},{"$f":"IF(Y$3=\"\",\"\",IF(AND($B88=\"Y\",$C88=\"Y\",$G88=\"Y\",Y88=Y$3),1,\"\"))","v":""},{"$f":"IF(B88<>\"Y\",\"\",IF(Z88=\"\",\"\",Z88*$E$3))","v":""}]
[84,{"$nulls":24},{"$f":"IF(SUM(AB89:AS89)=0,\"\",SUM(AB89:AS89))","v":""},null,{"$f":"IF(H$3=\"\",\"\",IF(AND($B89=\"Y\",$C89=\"Y\",$G89=\"Y\",H89=H$3),1,\"\"))","v":""},{"$f":"IF(I$3=\"\",\"\",IF(AND($B89=\"Y\",$C89=\"Y\",$G89=\"Y\",I89=I$3),1,\"\"))","v":""},{"$f":"IF(J$3=\"\",\"\",IF(AND($B89=\"Y\",$C89=\"Y\",$G89=\"Y\",J89=J$3),1,\"\"))","v":""},{"$f":"IF(K$3=\"\",\"\",IF(AND($B89=\"Y\",$C89=\"Y\",$G89=\"Y\",K89=K$3),1,\"\"))","v":""},{"$f":"IF(L$3=\"\",\"\",IF(AND($B89=\"Y\",$C89=\"Y\",$G89=\"Y\",L89=L$3),1,\"\"))","v":""},{"$f":"IF(M$3=\"\",\"\",IF(AND($B89=\"Y\",$C89=\"Y\",$G89=\"Y\",M89=M$3),1,\"\"))","v":""},{"$f":"IF(N$3=\"\",\"\",IF(AND($B89=\"Y\",$C89=\"Y\",$G89=\"Y\",N89=N$3),1,\"\"))","v":""},{"$f":"IF(O$3=\"\",\"\",IF(AND($B89=\"Y\",$C89=\"Y\",$G89=\"Y\",O89=O$3),1,\"\"))","v":""},{"$f":"IF(P$3=\"\",\"\",IF(AND($B89=\"Y\",$C89=\"Y\",$G89=\"Y\",P89=P$3),1,\"\"))","v":""},{"$f":"IF(Q$3=\"\",\"\",IF(AND($B89=\"Y\",$C89=\"Y\",$G89=\"Y\",Q89=Q$3),1,\"\"))","v":""},{"$f":"IF(R$3=\"\",\"\",IF(AND($B89=\"Y\",$C89=\"Y\",$G89=\"Y\",R89=R$3),1,\"\"))","v":""},{"$f":"IF(S$3=\"\",\"\",IF(AND($B89=\"Y\",$C89=\"Y\",$G89=\"Y\",S89=S$3),1,\"\"))","v":""},{"$f":"IF(T$3=\"\",\"\",IF(AND($B89=\"Y\",$C89=\"Y\",$G89=\"Y\",T89=T$3),1,\"\"))","v":""},{"$f":"IF(U$3=\"\",\"\",IF(AND($B89=\"Y\",$C89=\"Y\",$G89=\"Y\",U89=U$3),1,\"\"))","v":""},{"$f":"IF(V$3=\"\",\"\",IF(AND($B89=\"Y\",$C89=\"Y\",$G89=\"Y\",V89=V$3),1,\"\"))","v":""},{"$f":"IF(W$3=\"\",\"\",IF(AND($B89=\"Y\",$C89=\"Y\",$G89=\"Y\",W89=W$3),1,\"\"))","v":""},{"$f":"IF(X$3=\"\",\"\",IF(AND($B89=\"Y\",$C89=\"Y\",$G89=\"Y\",X89=X$3),1,\"\"))","v":""},{"$f":"IF(Y$3=\"\",\"\",IF(AND($B89=\"Y\",$C89=\"Y\",$G89=\"Y\",Y89=Y$3),1,\"\"))","v":""},{"$f":"IF(B89<>\"Y\",\"\",IF(Z89=\"\",\"\",Z89*$E$3))","v":""}]
[85,{"$nulls":24},{"$f":"IF(SUM(AB90:AS90)=0,\"\",SUM(AB90:AS90))","v":""},null,{"$f":"IF(H$3=\"\",\"\",IF(AND($B90=\"Y\",$C90=\"Y\",$G90=\"Y\",H90=H$3),1,\"\"))","v":""},{"$f":"IF(I$3=\"\",\"\",IF(AND($B90=\"Y\",$C90=\"Y\",$G90=\"Y\",I90=I$3),1,\"\"))","v":""},{"$f":"IF(J$3=\"\",\"\",IF(AND($B90=\"Y\",$C90=\"Y\",$G90=\"Y\",J90=J$3),1,\"\"))","v":""},{"$f":"IF(K$3=\"\",\"\",IF(AND($B90=\"Y\",$C90=\"Y\",$G90=\"Y\",K90=K$3),1,\"\"))","v":""},{"$f":"IF(L$3=\"\",\"\",IF(AND($B90=\"Y\",$C90=\"Y\",$G90=\"Y\",L90=L$3),1,\"\"))","v":""},{"$f":"IF(M$3=\"\",\"\",IF(AND($B90=\"Y\",$C90=\"Y\",$G90=\"Y\",M90=M$3),1,\"\"))","v":""},{"$f":"IF(N$3=\"\",\"\",IF(AND($B90=\"Y\",$C90=\"Y\",$G90=\"Y\",N90=N$3),1,\"\"))","v":""},{"$f":"IF(O$3=\"\",\"\",IF(AND($B90=\"Y\",$C90=\"Y\",$G90=\"Y\",O90=O$3),1,\"\"))","v":""},{"$f":"IF(P$3=\"\",\"\",IF(AND($B90=\"Y\",$C90=\"Y\",$G90=\"Y\",P90=P$3),1,\"\"))","v":""},{"$f":"IF(Q$3=\"\",\"\",IF(AND($B90=\"Y\",$C90=\"Y\",$G90=\"Y\",Q90=Q$3),1,\"\"))","v":""},{"$f":"IF(R$3=\"\",\"\",IF(AND($B90=\"Y\",$C90=\"Y\",$G90=\"Y\",R90=R$3),1,\"\"))","v":""},{"$f":"IF(S$3=\"\",\"\",IF(AND($B90=\"Y\",$C90=\"Y\",$G90=\"Y\",S90=S$3),1,\"\"))","v":""},{"$f":"IF(T$3=\"\",\"\",IF(AND($B90=\"Y\",$C90=\"Y\",$G90=\"Y\",T90=T$3),1,\"\"))","v":""},{"$f":"IF(U$3=\"\",\"\",IF(AND($B90=\"Y\",$C90=\"Y\",$G90=\"Y\",U90=U$3),1,\"\"))","v":""},{"$f":"IF(V$3=\"\",\"\",IF(AND($B90=\"Y\",$C90=\"Y\",$G90=\"Y\",V90=V$3),1,\"\"))","v":""},{"$f":"IF(W$3=\"\",\"\",IF(AND($B90=\"Y\",$C90=\"Y\",$G90=\"Y\",W90=W$3),1,\"\"))","v":""},{"$f":"IF(X$3=\"\",\"\",IF(AND($B90=\"Y\",$C90=\"Y\",$G90=\"Y\",X90=X$3),1,\"\"))","v":""},{"$f":"IF(Y$3=\"\",\"\",IF(AND($B90=\"Y\",$C90=\"Y\",$G90=\"Y\",Y90=Y$3),1,\"\"))","v":""},{"$f":"IF(B90<>\"Y\",\"\",IF(Z90=\"\",\"\",Z90*$E$3))","v":""}]
[86,{"$nulls":24},{"$f":"IF(SUM(AB91:AS91)=0,\"\",SUM(AB91:AS91))","v":""},null,{"$f":"IF(H$3=\"\",\"\",IF(AND($B91=\"Y\",$C91=\"Y\",$G91=\"Y\",H91=H$3),1,\"\"))","v":""},{"$f":"IF(I$3=\"\",\"\",IF(AND($B91=\"Y\",$C91=\"Y\",$G91=\"Y\",I91=I$3),1,\"\"))","v":""},{"$f":"IF(J$3=\"\",\"\",IF(AND($B91=\"Y\",$C91=\"Y\",$G91=\"Y\",J91=J$3),1,\"\"))","v":""},{"$f":"IF(K$3=\"\",\"\",IF(AND($B91=\"Y\",$C91=\"Y\",$G91=\"Y\",K91=K$3),1,\"\"))","v":""},{"$f":"IF(L$3=\"\",\"\",IF(AND($B91=\"Y\",$C91=\"Y\",$G91=\"Y\",L91=L$3),1,\"\"))","v":""},{"$f":"IF(M$3=\"\",\"\",IF(AND($B91=\"Y\",$C91=\"Y\",$G91=\"Y\",M91=M$3),1,\"\"))","v":""},{"$f":"IF(N$3=\"\",\"\",IF(AND($B91=\"Y\",$C91=\"Y\",$G91=\"Y\",N91=N$3),1,\"\"))","v":""},{"$f":"IF(O$3=\"\",\"\",IF(AND($B91=\"Y\",$C91=\"Y\",$G91=\"Y\",O91=O$3),1,\"\"))","v":""},{"$f":"IF(P$3=\"\",\"\",IF(AND($B91=\"Y\",$C91=\"Y\",$G91=\"Y\",P91=P$3),1,\"\"))","v":""},{"$f":"IF(Q$3=\"\",\"\",IF(AND($B91=\"Y\",$C91=\"Y\",$G91=\"Y\",Q91=Q$3),1,\"\"))","v":""},{"$f":"IF(R$3=\"\",\"\",IF(AND($B91=\"Y\",$C91=\"Y\",$G91=\"Y\",R91=R$3),1,\"\"))","v":""},{"$f":"IF(S$3=\"\",\"\",IF(AND($B91=\"Y\",$C91=\"Y\",$G91=\"Y\",S91=S$3),1,\"\"))","v":""},{"$f":"IF(T$3=\"\",\"\",IF(AND($B91=\"Y\",$C91=\"Y\",$G91=\"Y\",T91=T$3),1,\"\"))","v":""},{"$f":"IF(U$3=\"\",\"\",IF(AND($B91=\"Y\",$C91=\"Y\",$G91=\"Y\",U91=U$3),1,\"\"))","v":""},{"$f":"IF(V$3=\"\",\"\",IF(AND($B91=\"Y\",$C91=\"Y\",$G91=\"Y\",V91=V$3),1,\"\"))","v":""},{"$f":"IF(W$3=\"\",\"\",IF(AND($B91=\"Y\",$C91=\"Y\",$G91=\"Y\",W91=W$3),1,\"\"))","v":""},{"$f":"IF(X$3=\"\",\"\",IF(AND($B91=\"Y\",$C91=\"Y\",$G91=\"Y\",X91=X$3),1,\"\"))","v":""},{"$f":"IF(Y$3=\"\",\"\",IF(AND($B91=\"Y\",$C91=\"Y\",$G91=\"Y\",Y91=Y$3),1,\"\"))","v":""},{"$f":"IF(B91<>\"Y\",\"\",IF(Z91=\"\",\"\",Z91*$E$3))","v":""}]
[87,{"$nulls":24},{"$f":"IF(SUM(AB92:AS92)=0,\"\",SUM(AB92:AS92))","v":""},null,{"$f":"IF(H$3=\"\",\"\",IF(AND($B92=\"Y\",$C92=\"Y\",$G92=\"Y\",H92=H$3),1,\"\"))","v":""},{"$f":"IF(I$3=\"\",\"\",IF(AND($B92=\"Y\",$C92=\"Y\",$G92=\"Y\",I92=I$3),1,\"\"))","v":""},{"$f":"IF(J$3=\"\",\"\",IF(AND($B92=\"Y\",$C92=\"Y\",$G92=\"Y\",J92=J$3),1,\"\"))","v":""},{"$f":"IF(K$3=\"\",\"\",IF(AND($B92=\"Y\",$C92=\"Y\",$G92=\"Y\",K92=K$3),1,\"\"))","v":""},{"$f":"IF(L$3=\"\",\"\",IF(AND($B92=\"Y\",$C92=\"Y\",$G92=\"Y\",L92=L$3),1,\"\"))","v":""},{"$f":"IF(M$3=\"\",\"\",IF(AND($B92=\"Y\",$C92=\"Y\",$G92=\"Y\",M92=M$3),1,\"\"))","v":""},{"$f":"IF(N$3=\"\",\"\",IF(AND($B92=\"Y\",$C92=\"Y\",$G92=\"Y\",N92=N$3),1,\"\"))","v":""},{"$f":"IF(O$3=\"\",\"\",IF(AND($B92=\"Y\",$C92=\"Y\",$G92=\"Y\",O92=O$3),1,\"\"))","v":""},{"$f":"IF(P$3=\"\",\"\",IF(AND($B92=\"Y\",$C92=\"Y\",$G92=\"Y\",P92=P$3),1,\"\"))","v":""},{"$f":"IF(Q$3=\"\",\"\",IF(AND($B92=\"Y\",$C92=\"Y\",$G92=\"Y\",Q92=Q$3),1,\"\"))","v":""},{"$f":"IF(R$3=\"\",\"\",IF(AND($B92=\"Y\",$C92=\"Y\",$G92=\"Y\",R92=R$3),1,\"\"))","v":""},{"$f":"IF(S$3=\"\",\"\",IF(AND($B92=\"Y\",$C92=\"Y\",$G92=\"Y\",S92=S$3),1,\"\"))","v":""},{"$f":"IF(T$3=\"\",\"\",IF(AND($B92=\"Y\",$C92=\"Y\",$G92=\"Y\",T92=T$3),1,\"\"))","v":""},{"$f":"IF(U$3=\"\",\"\",IF(AND($B92=\"Y\",$C92=\"Y\",$G92=\"Y\",U92=U$3),1,\"\"))","v":""},{"$f":"IF(V$3=\"\",\"\",IF(AND($B92=\"Y\",$C92=\"Y\",$G92=\"Y\",V92=V$3),1,\"\"))","v":""},{"$f":"IF(W$3=\"\",\"\",IF(AND($B92=\"Y\",$C92=\"Y\",$G92=\"Y\",W92=W$3),1,\"\"))","v":""},{"$f":"IF(X$3=\"\",\"\",IF(AND($B92=\"Y\",$C92=\"Y\",$G92=\"Y\",X92=X$3),1,\"\"))","v":""},{"$f":"IF(Y$3=\"\",\"\",IF(AND($B92=\"Y\",$C92=\"Y\",$G92=\"Y\",Y92=Y$3),1,\"\"))","v":""},{"$f":"IF(B92<>\"Y\",\"\",IF(Z92=\"\",\"\",Z92*$E$3))","v":""}]
[88,{"$nulls":24},{"$f":"IF(SUM(AB93:AS93)=0,\"\",SUM(AB93:AS93))","v":""},null,{"$f":"IF(H$3=\"\",\"\",IF(AND($B93=\"Y\",$C93=\"Y\",$G93=\"Y\",H93=H$3),1,\"\"))","v":""},{"$f":"IF(I$3=\"\",\"\",IF(AND($B93=\"Y\",$C93=\"Y\",$G93=\"Y\",I93=I$3),1,\"\"))","v":""},{"$f":"IF(J$3=\"\",\"\",IF(AND($B93=\"Y\",$C93=\"Y\",$G93=\"Y\",J93=J$3),1,\"\"))","v":""},{"$f":"IF(K$3=\"\",\"\",IF(AND($B93=\"Y\",$C93=\"Y\",$G93=\"Y\",K93=K$3),1,\"\"))","v":""},{"$f":"IF(L$3=\"\",\"\",IF(AND($B93=\"Y\",$C93=\"Y\",$G93=\"Y\",L93=L$3),1,\"\"))","v":""},{"$f":"IF(M$3=\"\",\"\",IF(AND($B93=\"Y\",$C93=\"Y\",$G93=\"Y\",M93=M$3),1,\"\"))","v":""},{"$f":"IF(N$3=\"\",\"\",IF(AND($B93=\"Y\",$C93=\"Y\",$G93=\"Y\",N93=N$3),1,\"\"))","v":""},{"$f":"IF(O$3=\"\",\"\",IF(AND($B93=\"Y\",$C93=\"Y\",$G93=\"Y\",O93=O$3),1,\"\"))","v":""},{"$f":"IF(P$3=\"\",\"\",IF(AND($B93=\"Y\",$C93=\"Y\",$G93=\"Y\",P93=P$3),1,\"\"))","v":""},{"$f":"IF(Q$3=\"\",\"\",IF(AND($B93=\"Y\",$C93=\"Y\",$G93=\"Y\",Q93=Q$3),1,\"\"))","v":""},{"$f":"IF(R$3=\"\",\"\",IF(AND($B93=\"Y\",$C93=\"Y\",$G93=\"Y\",R93=R$3),1,\"\"))","v":""},{"$f":"IF(S$3=\"\",\"\",IF(AND($B93=\"Y\",$C93=\"Y\",$G93=\"Y\",S93=S$3),1,\"\"))","v":""},{"$f":"IF(T$3=\"\",\"\",IF(AND($B93=\"Y\",$C93=\"Y\",$G93=\"Y\",T93=T$3),1,\"\"))","v":""},{"$f":"IF(U$3=\"\",\"\",IF(AND($B93=\"Y\",$C93=\"Y\",$G93=\"Y\",U93=U$3),1,\"\"))","v":""},{"$f":"IF(V$3=\"\",\"\",IF(AND($B93=\"Y\",$C93=\"Y\",$G93=\"Y\",V93=V$3),1,\"\"))","v":""},{"$f":"IF(W$3=\"\",\"\",IF(AND($B93=\"Y\",$C93=\"Y\",$G93=\"Y\",W93=W$3),1,\"\"))","v":""},{"$f":"IF(X$3=\"\",\"\",IF(AND($B93=\"Y\",$C93=\"Y\",$G93=\"Y\",X93=X$3),1,\"\"))","v":""},{"$f":"IF(Y$3=\"\",\"\",IF(AND($B93=\"Y\",$C93=\"Y\",$G93=\"Y\",Y93=Y$3),1,\"\"))","v":""},{"$f":"IF(B93<>\"Y\",\"\",IF(Z93=\"\",\"\",Z93*$E$3))","v":""}]
[89,{"$nulls":24},{"$f":"IF(SUM(AB94:AS94)=0,\"\",SUM(AB94:AS94))","v":""},null,{"$f":"IF(H$3=\"\",\"\",IF(AND($B94=\"Y\",$C94=\"Y\",$G94=\"Y\",H94=H$3),1,\"\"))","v":""},{"$f":"IF(I$3=\"\",\"\",IF(AND($B94=\"Y\",$C94=\"Y\",$G94=\"Y\",I94=I$3),1,\"\"))","v":""},{"$f":"IF(J$3=\"\",\"\",IF(AND($B94=\"Y\",$C94=\"Y\",$G94=\"Y\",J94=J$3),1,\"\"))","v":""},{"$f":"IF(K$3=\"\",\"\",IF(AND($B94=\"Y\",$C94=\"Y\",$G94=\"Y\",K94=K$3),1,\"\"))","v":""},{"$f":"IF(L$3=\"\",\"\",IF(AND($B94=\"Y\",$C94=\"Y\",$G94=\"Y\",L94=L$3),1,\"\"))","v":""},{"$f":"IF(M$3=\"\",\"\",IF(AND($B94=\"Y\",$C94=\"Y\",$G94=\"Y\",M94=M$3),1,\"\"))","v":""},{"$f":"IF(N$3=\"\",\"\",IF(AND($B94=\"Y\",$C94=\"Y\",$G94=\"Y\",N94=N$3),1,\"\"))","v":""},{"$f":"IF(O$3=\"\",\"\",IF(AND($B94=\"Y\",$C94=\"Y\",$G94=\"Y\",O94=O$3),1,\"\"))","v":""},{"$f":"IF(P$3=\"\",\"\",IF(AND($B94=\"Y\",$C94=\"Y\",$G94=\"Y\",P94=P$3),1,\"\"))","v":""},{"$f":"IF(Q$3=\"\",\"\",IF(AND($B94=\"Y\",$C94=\"Y\",$G94=\"Y\",Q94=Q$3),1,\"\"))","v":""},{"$f":"IF(R$3=\"\",\"\",IF(AND($B94=\"Y\",$C94=\"Y\",$G94=\"Y\",R94=R$3),1,\"\"))","v":""},{"$f":"IF(S$3=\"\",\"\",IF(AND($B94=\"Y\",$C94=\"Y\",$G94=\"Y\",S94=S$3),1,\"\"))","v":""},{"$f":"IF(T$3=\"\",\"\",IF(AND($B94=\"Y\",$C94=\"Y\",$G94=\"Y\",T94=T$3),1,\"\"))","v":""},{"$f":"IF(U$3=\"\",\"\",IF(AND($B94=\"Y\",$C94=\"Y\",$G94=\"Y\",U94=U$3),1,\"\"))","v":""},{"$f":"IF(V$3=\"\",\"\",IF(AND($B94=\"Y\",$C94=\"Y\",$G94=\"Y\",V94=V$3),1,\"\"))","v":""},{"$f":"IF(W$3=\"\",\"\",IF(AND($B94=\"Y\",$C94=\"Y\",$G94=\"Y\",W94=W$3),1,\"\"))","v":""},{"$f":"IF(X$3=\"\",\"\",IF(AND($B94=\"Y\",$C94=\"Y\",$G94=\"Y\",X94=X$3),1,\"\"))","v":""},{"$f":"IF(Y$3=\"\",\"\",IF(AND($B94=\"Y\",$C94=\"Y\",$G94=\"Y\",Y94=Y$3),1,\"\"))","v":""},{"$f":"IF(B94<>\"Y\",\"\",IF(Z94=\"\",\"\",Z94*$E$3))","v":""}]
[90,{"$nulls":24},{"$f":"IF(SUM(AB95:AS95)=0,\"\",SUM(AB95:AS95))","v":""},null,{"$f":"IF(H$3=\"\",\"\",IF(AND($B95=\"Y\",$C95=\"Y\",$G95=\"Y\",H95=H$3),1,\"\"))","v":""},{"$f":"IF(I$3=\"\",\"\",IF(AND($B95=\"Y\",$C95=\"Y\",$G95=\"Y\",I95=I$3),1,\"\"))","v":""},{"$f":"IF(J$3=\"\",\"\",IF(AND($B95=\"Y\",$C95=\"Y\",$G95=\"Y\",J95=J$3),1,\"\"))","v":""},{"$f":"IF(K$3=\"\",\"\",IF(AND($B95=\"Y\",$C95=\"Y\",$G95=\"Y\",K95=K$3),1,\"\"))","v":""},{"$f":"IF(L$3=\"\",\"\",IF(AND($B95=\"Y\",$C95=\"Y\",$G95=\"Y\",L95=L$3),1,\"\"))","v":""},{"$f":"IF(M$3=\"\",\"\",IF(AND($B95=\"Y\",$C95=\"Y\",$G95=\"Y\",M95=M$3),1,\"\"))","v":""},{"$f":"IF(N$3=\"\",\"\",IF(AND($B95=\"Y\",$C95=\"Y\",$G95=\"Y\",N95=N$3),1,\"\"))","v":""},{"$f":"IF(O$3=\"\",\"\",IF(AND($B95=\"Y\",$C95=\"Y\",$G95=\"Y\",O95=O$3),1,\"\"))","v":""},{"$f":"IF(P$3=\"\",\"\",IF(AND($B95=\"Y\",$C95=\"Y\",$G95=\"Y\",P95=P$3),1,\"\"))","v":""},{"$f":"IF(Q$3=\"\",\"\",IF(AND($B95=\"Y\",$C95=\"Y\",$G95=\"Y\",Q95=Q$3),1,\"\"))","v":""},{"$f":"IF(R$3=\"\",\"\",IF(AND($B95=\"Y\",$C95=\"Y\",$G95=\"Y\",R95=R$3),1,\"\"))","v":""},{"$f":"IF(S$3=\"\",\"\",IF(AND($B95=\"Y\",$C95=\"Y\",$G95=\"Y\",S95=S$3),1,\"\"))","v":""},{"$f":"IF(T$3=\"\",\"\",IF(AND($B95=\"Y\",$C95=\"Y\",$G95=\"Y\",T95=T$3),1,\"\"))","v":""},{"$f":"IF(U$3=\"\",\"\",IF(AND($B95=\"Y\",$C95=\"Y\",$G95=\"Y\",U95=U$3),1,\"\"))","v":""},{"$f":"IF(V$3=\"\",\"\",IF(AND($B95=\"Y\",$C95=\"Y\",$G95=\"Y\",V95=V$3),1,\"\"))","v":""},{"$f":"IF(W$3=\"\",\"\",IF(AND($B95=\"Y\",$C95=\"Y\",$G95=\"Y\",W95=W$3),1,\"\"))","v":""},{"$f":"IF(X$3=\"\",\"\",IF(AND($B95=\"Y\",$C95=\"Y\",$G95=\"Y\",X95=X$3),1,\"\"))","v":""},{"$f":"IF(Y$3=\"\",\"\",IF(AND($B95=\"Y\",$C95=\"Y\",$G95=\"Y\",Y95=Y$3),1,\"\"))","v":""},{"$f":"IF(B95<>\"Y\",\"\",IF(Z95=\"\",\"\",Z95*$E$3))","v":""}]
[91,{"$nulls":24},{"$f":"IF(SUM(AB96:AS96)=0,\"\",SUM(AB96:AS96))","v":""},null,{"$f":"IF(H$3=\"\",\"\",IF(AND($B96=\"Y\",$C96=\"Y\",$G96=\"Y\",H96=H$3),1,\"\"))","v":""},{"$f":"IF(I$3=\"\",\"\",IF(AND($B96=\"Y\",$C96=\"Y\",$G96=\"Y\",I96=I$3),1,\"\"))","v":""},{"$f":"IF(J$3=\"\",\"\",IF(AND($B96=\"Y\",$C96=\"Y\",$G96=\"Y\",J96=J$3),1,\"\"))","v":""},{"$f":"IF(K$3=\"\",\"\",IF(AND($B96=\"Y\",$C96=\"Y\",$G96=\"Y\",K96=K$3),1,\"\"))","v":""},{"$f":"IF(L$3=\"\",\"\",IF(AND($B96=\"Y\",$C96=\"Y\",$G96=\"Y\",L96=L$3),1,\"\"))","v":""},{"$f":"IF(M$3=\"\",\"\",IF(AND($B96=\"Y\",$C96=\"Y\",$G96=\"Y\",M96=M$3),1,\"\"))","v":""},{"$f":"IF(N$3=\"\",\"\",IF(AND($B96=\"Y\",$C96=\"Y\",$G96=\"Y\",N96=N$3),1,\"\"))","v":""},{"$f":"IF(O$3=\"\",\"\",IF(AND($B96=\"Y\",$C96=\"Y\",$G96=\"Y\",O96=O$3),1,\"\"))","v":""},{"$f":"IF(P$3=\"\",\"\",IF(AND($B96=\"Y\",$C96=\"Y\",$G96=\"Y\",P96=P$3),1,\"\"))","v":""},{"$f":"IF(Q$3=\"\",\"\",IF(AND($B96=\"Y\",$C96=\"Y\",$G96=\"Y\",Q96=Q$3),1,\"\"))","v":""},{"$f":"IF(R$3=\"\",\"\",IF(AND($B96=\"Y\",$C96=\"Y\",$G96=\"Y\",R96=R$3),1,\"\"))","v":""},{"$f":"IF(S$3=\"\",\"\",IF(AND($B96=\"Y\",$C96=\"Y\",$G96=\"Y\",S96=S$3),1,\"\"))","v":""},{"$f":"IF(T$3=\"\",\"\",IF(AND($B96=\"Y\",$C96=\"Y\",$G96=\"Y\",T96=T$3),1,\"\"))","v":""},{"$f":"IF(U$3=\"\",\"\",IF(AND($B96=\"Y\",$C96=\"Y\",$G96=\"Y\",U96=U$3),1,\"\"))","v":""},{"$f":"IF(V$3=\"\",\"\",IF(AND($B96=\"Y\",$C96=\"Y\",$G96=\"Y\",V96=V$3),1,\"\"))","v":""},{"$f":"IF(W$3=\"\",\"\",IF(AND($B96=\"Y\",$C96=\"Y\",$G96=\"Y\",W96=W$3),1,\"\"))","v":""},{"$f":"IF(X$3=\"\",\"\",IF(AND($B96=\"Y\",$C96=\"Y\",$G96=\"Y\",X96=X$3),1,\"\"))","v":""},{"$f":"IF(Y$3=\"\",\"\",IF(AND($B96=\"Y\",$C96=\"Y\",$G96=\"Y\",Y96=Y$3),1,\"\"))","v":""},{"$f":"IF(B96<>\"Y\",\"\",IF(Z96=\"\",\"\",Z96*$E$3))","v":""}]
[92,{"$nulls":24},{"$f":"IF(SUM(AB97:AS97)=0,\"\",SUM(AB97:AS97))","v":""},null,{"$f":"IF(H$3=\"\",\"\",IF(AND($B97=\"Y\",$C97=\"Y\",$G97=\"Y\",H97=H$3),1,\"\"))","v":""},{"$f":"IF(I$3=\"\",\"\",IF(AND($B97=\"Y\",$C97=\"Y\",$G97=\"Y\",I97=I$3),1,\"\"))","v":""},{"$f":"IF(J$3=\"\",\"\",IF(AND($B97=\"Y\",$C97=\"Y\",$G97=\"Y\",J97=J$3),1,\"\"))","v":""},{"$f":"IF(K$3=\"\",\"\",IF(AND($B97=\"Y\",$C97=\"Y\",$G97=\"Y\",K97=K$3),1,\"\"))","v":""},{"$f":"IF(L$3=\"\",\"\",IF(AND($B97=\"Y\",$C97=\"Y\",$G97=\"Y\",L97=L$3),1,\"\"))","v":""},{"$f":"IF(M$3=\"\",\"\",IF(AND($B97=\"Y\",$C97=\"Y\",$G97=\"Y\",M97=M$3),1,\"\"))","v":""},{"$f":"IF(N$3=\"\",\"\",IF(AND($B97=\"Y\",$C97=\"Y\",$G97=\"Y\",N97=N$3),1,\"\"))","v":""},{"$f":"IF(O$3=\"\",\"\",IF(AND($B97=\"Y\",$C97=\"Y\",$G97=\"Y\",O97=O$3),1,\"\"))","v":""},{"$f":"IF(P$3=\"\",\"\",IF(AND($B97=\"Y\",$C97=\"Y\",$G97=\"Y\",P97=P$3),1,\"\"))","v":""},{"$f":"IF(Q$3=\"\",\"\",IF(AND($B97=\"Y\",$C97=\"Y\",$G97=\"Y\",Q97=Q$3),1,\"\"))","v":""},{"$f":"IF(R$3=\"\",\"\",IF(AND($B97=\"Y\",$C97=\"Y\",$G97=\"Y\",R97=R$3),1,\"\"))","v":""},{"$f":"IF(S$3=\"\",\"\",IF(AND($B97=\"Y\",$C97=\"Y\",$G97=\"Y\",S97=S$3),1,\"\"))","v":""},{"$f":"IF(T$3=\"\",\"\",IF(AND($B97=\"Y\",$C97=\"Y\",$G97=\"Y\",T97=T$3),1,\"\"))","v":""},{"$f":"IF(U$3=\"\",\"\",IF(AND($B97=\"Y\",$C97=\"Y\",$G97=\"Y\",U97=U$3),1,\"\"))","v":""},{"$f":"IF(V$3=\"\",\"\",IF(AND($B97=\"Y\",$C97=\"Y\",$G97=\"Y\",V97=V$3),1,\"\"))","v":""},{"$f":"IF(W$3=\"\",\"\",IF(AND($B97=\"Y\",$C97=\"Y\",$G97=\"Y\",W97=W$3),1,\"\"))","v":""},{"$f":"IF(X$3=\"\",\"\",IF(AND($B97=\"Y\",$C97=\"Y\",$G97=\"Y\",X97=X$3),1,\"\"))","v":""},{"$f":"IF(Y$3=\"\",\"\",IF(AND($B97=\"Y\",$C97=\"Y\",$G97=\"Y\",Y97=Y$3),1,\"\"))","v":""},{"$f":"IF(B97<>\"Y\",\"\",IF(Z97=\"\",\"\",Z97*$E$3))","v":""}]
[93,{"$nulls":24},{"$f":"IF(SUM(AB98:AS98)=0,\"\",SUM(AB98:AS98))","v":""},null,{"$f":"IF(H$3=\"\",\"\",IF(AND($B98=\"Y\",$C98=\"Y\",$G98=\"Y\",H98=H$3),1,\"\"))","v":""},{"$f":"IF(I$3=\"\",\"\",IF(AND($B98=\"Y\",$C98=\"Y\",$G98=\"Y\",I98=I$3),1,\"\"))","v":""},{"$f":"IF(J$3=\"\",\"\",IF(AND($B98=\"Y\",$C98=\"Y\",$G98=\"Y\",J98=J$3),1,\"\"))","v":""},{"$f":"IF(K$3=\"\",\"\",IF(AND($B98=\"Y\",$C98=\"Y\",$G98=\"Y\",K98=K$3),1,\"\"))","v":""},{"$f":"IF(L$3=\"\",\"\",IF(AND($B98=\"Y\",$C98=\"Y\",$G98=\"Y\",L98=L$3),1,\"\"))","v":""},{"$f":"IF(M$3=\"\",\"\",IF(AND($B98=\"Y\",$C98=\"Y\",$G98=\"Y\",M98=M$3),1,\"\"))","v":""},{"$f":"IF(N$3=\"\",\"\",IF(AND($B98=\"Y\",$C98=\"Y\",$G98=\"Y\",N98=N$3),1,\"\"))","v":""},{"$f":"IF(O$3=\"\",\"\",IF(AND($B98=\"Y\",$C98=\"Y\",$G98=\"Y\",O98=O$3),1,\"\"))","v":""},{"$f":"IF(P$3=\"\",\"\",IF(AND($B98=\"Y\",$C98=\"Y\",$G98=\"Y\",P98=P$3),1,\"\"))","v":""},{"$f":"IF(Q$3=\"\",\"\",IF(AND($B98=\"Y\",$C98=\"Y\",$G98=\"Y\",Q98=Q$3),1,\"\"))","v":""},{"$f":"IF(R$3=\"\",\"\",IF(AND($B98=\"Y\",$C98=\"Y\",$G98=\"Y\",R98=R$3),1,\"\"))","v":""},{"$f":"IF(S$3=\"\",\"\",IF(AND($B98=\"Y\",$C98=\"Y\",$G98=\"Y\",S98=S$3),1,\"\"))","v":""},{"$f":"IF(T$3=\"\",\"\",IF(AND($B98=\"Y\",$C98=\"Y\",$G98=\"Y\",T98=T$3),1,\"\"))","v":""},{"$f":"IF(U$3=\"\",\"\",IF(AND($B98=\"Y\",$C98=\"Y\",$G98=\"Y\",U98=U$3),1,\"\"))","v":""},{"$f":"IF(V$3=\"\",\"\",IF(AND($B98=\"Y\",$C98=\"Y\",$G98=\"Y\",V98=V$3),1,\"\"))","v":""},{"$f":"IF(W$3=\"\",\"\",IF(AND($B98=\"Y\",$C98=\"Y\",$G98=\"Y\",W98=W$3),1,\"\"))","v":""},{"$f":"IF(X$3=\"\",\"\",IF(AND($B98=\"Y\",$C98=\"Y\",$G98=\"Y\",X98=X$3),1,\"\"))","v":""},{"$f":"IF(Y$3=\"\",\"\",IF(AND($B98=\"Y\",$C98=\"Y\",$G98=\"Y\",Y98=Y$3),1,\"\"))","v":""},{"$f":"IF(B98<>\"Y\",\"\",IF(Z98=\"\",\"\",Z98*$E$3))","v":""}]
[94,{"$nulls":24},{"$f":"IF(SUM(AB99:AS99)=0,\"\",SUM(AB99:AS99))","v":""},null,{"$f":"IF(H$3=\"\",\"\",IF(AND($B99=\"Y\",$C99=\"Y\",$G99=\"Y\",H99=H$3),1,\"\"))","v":""},{"$f":"IF(I$3=\"\",\"\",IF(AND($B99=\"Y\",$C99=\"Y\",$G99=\"Y\",I99=I$3),1,\"\"))","v":""},{"$f":"IF(J$3=\"\",\"\",IF(AND($B99=\"Y\",$C99=\"Y\",$G99=\"Y\",J99=J$3),1,\"\"))","v":""},{"$f":"IF(K$3=\"\",\"\",IF(AND($B99=\"Y\",$C99=\"Y\",$G99=\"Y\",K99=K$3),1,\"\"))","v":""},{"$f":"IF(L$3=\"\",\"\",IF(AND($B99=\"Y\",$C99=\"Y\",$G99=\"Y\",L99=L$3),1,\"\"))","v":""},{"$f":"IF(M$3=\"\",\"\",IF(AND($B99=\"Y\",$C99=\"Y\",$G99=\"Y\",M99=M$3),1,\"\"))","v":""},{"$f":"IF(N$3=\"\",\"\",IF(AND($B99=\"Y\",$C99=\"Y\",$G99=\"Y\",N99=N$3),1,\"\"))","v":""},{"$f":"IF(O$3=\"\",\"\",IF(AND($B99=\"Y\",$C99=\"Y\",$G99=\"Y\",O99=O$3),1,\"\"))","v":""},{"$f":"IF(P$3=\"\",\"\",IF(AND($B99=\"Y\",$C99=\"Y\",$G99=\"Y\",P99=P$3),1,\"\"))","v":""},{"$f":"IF(Q$3=\"\",\"\",IF(AND($B99=\"Y\",$C99=\"Y\",$G99=\"Y\",Q99=Q$3),1,\"\"))","v":""},{"$f":"IF(R$3=\"\",\"\",IF(AND($B99=\"Y\",$C99=\"Y\",$G99=\"Y\",R99=R$3),1,\"\"))","v":""},{"$f":"IF(S$3=\"\",\"\",IF(AND($B99=\"Y\",$C99=\"Y\",$G99=\"Y\",S99=S$3),1,\"\"))","v":""},{"$f":"IF(T$3=\"\",\"\",IF(AND($B99=\"Y\",$C99=\"Y\",$G99=\"Y\",T99=T$3),1,\"\"))","v":""},{"$f":"IF(U$3=\"\",\"\",IF(AND($B99=\"Y\",$C99=\"Y\",$G99=\"Y\",U99=U$3),1,\"\"))","v":""},{"$f":"IF(V$3=\"\",\"\",IF(AND($B99=\"Y\",$C99=\"Y\",$G99=\"Y\",V99=V$3),1,\"\"))","v":""},{"$f":"IF(W$3=\"\",\"\",IF(AND($B99=\"Y\",$C99=\"Y\",$G99=\"Y\",W99=W$3),1,\"\"))","v":""},{"$f":"IF(X$3=\"\",\"\",IF(AND($B99=\"Y\",$C99=\"Y\",$G99=\"Y\",X99=X$3),1,\"\"))","v":""},{"$f":"IF(Y$3=\"\",\"\",IF(AND($B99=\"Y\",$C99=\"Y\",$G99=\"Y\",Y99=Y$3),1,\"\"))","v":""},{"$f":"IF(B99<>\"Y\",\"\",IF(Z99=\"\",\"\",Z99*$E$3))","v":""}]
[95,{"$nulls":24},{"$f":"IF(SUM(AB100:AS100)=0,\"\",SUM(AB100:AS100))","v":""},null,{"$f":"IF(H$3=\"\",\"\",IF(AND($B100=\"Y\",$C100=\"Y\",$G100=\"Y\",H100=H$3),1,\"\"))","v":""},{"$f":"IF(I$3=\"\",\"\",IF(AND($B100=\"Y\",$C100=\"Y\",$G100=\"Y\",I100=I$3),1,\"\"))","v":""},{"$f":"IF(J$3=\"\",\"\",IF(AND($B100=\"Y\",$C100=\"Y\",$G100=\"Y\",J100=J$3),1,\"\"))","v":""},{"$f":"IF(K$3=\"\",\"\",IF(AND($B100=\"Y\",$C100=\"Y\",$G100=\"Y\",K100=K$3),1,\"\"))","v":""},{"$f":"IF(L$3=\"\",\"\",IF(AND($B100=\"Y\",$C100=\"Y\",$G100=\"Y\",L100=L$3),1,\"\"))","v":""},{"$f":"IF(M$3=\"\",\"\",IF(AND($B100=\"Y\",$C100=\"Y\",$G100=\"Y\",M100=M$3),1,\"\"))","v":""},{"$f":"IF(N$3=\"\",\"\",IF(AND($B100=\"Y\",$C100=\"Y\",$G100=\"Y\",N100=N$3),1,\"\"))","v":""},{"$f":"IF(O$3=\"\",\"\",IF(AND($B100=\"Y\",$C100=\"Y\",$G100=\"Y\",O100=O$3),1,\"\"))","v":""},{"$f":"IF(P$3=\"\",\"\",IF(AND($B100=\"Y\",$C100=\"Y\",$G100=\"Y\",P100=P$3),1,\"\"))","v":""},{"$f":"IF(Q$3=\"\",\"\",IF(AND($B100=\"Y\",$C100=\"Y\",$G100=\"Y\",Q100=Q$3),1,\"\"))","v":""},{"$f":"IF(R$3=\"\",\"\",IF(AND($B100=\"Y\",$C100=\"Y\",$G100=\"Y\",R100=R$3),1,\"\"))","v":""},{"$f":"IF(S$3=\"\",\"\",IF(AND($B100=\"Y\",$C100=\"Y\",$G100=\"Y\",S100=S$3),1,\"\"))","v":""},{"$f":"IF(T$3=\"\",\"\",IF(AND($B100=\"Y\",$C100=\"Y\",$G100=\"Y\",T100=T$3),1,\"\"))","v":""},{"$f":"IF(U$3=\"\",\"\",IF(AND($B100=\"Y\",$C100=\"Y\",$G100=\"Y\",U100=U$3),1,\"\"))","v":""},{"$f":"IF(V$3=\"\",\"\",IF(AND($B100=\"Y\",$C100=\"Y\",$G100=\"Y\",V100=V$3),1,\"\"))","v":""},{"$f":"IF(W$3=\"\",\"\",IF(AND($B100=\"Y\",$C100=\"Y\",$G100=\"Y\",W100=W$3),1,\"\"))","v":""},{"$f":"IF(X$3=\"\",\"\",IF(AND($B100=\"Y\",$C100=\"Y\",$G100=\"Y\",X100=X$3),1,\"\"))","v":""},{"$f":"IF(Y$3=\"\",\"\",IF(AND($B100=\"Y\",$C100=\"Y\",$G100=\"Y\",Y100=Y$3),1,\"\"))","v":""},{"$f":"IF(B100<>\"Y\",\"\",IF(Z100=\"\",\"\",Z100*$E$3))","v":""}]
[96,{"$nulls":24},{"$f":"IF(SUM(AB101:AS101)=0,\"\",SUM(AB101:AS101))","v":""},null,{"$f":"IF(H$3=\"\",\"\",IF(AND($B101=\"Y\",$C101=\"Y\",$G101=\"Y\",H101=H$3),1,\"\"))","v":""},{"$f":"IF(I$3=\"\",\"\",IF(AND($B101=\"Y\",$C101=\"Y\",$G101=\"Y\",I101=I$3),1,\"\"))","v":""},{"$f":"IF(J$3=\"\",\"\",IF(AND($B101=\"Y\",$C101=\"Y\",$G101=\"Y\",J101=J$3),1,\"\"))","v":""},{"$f":"IF(K$3=\"\",\"\",IF(AND($B101=\"Y\",$C101=\"Y\",$G101=\"Y\",K101=K$3),1,\"\"))","v":""},{"$f":"IF(L$3=\"\",\"\",IF(AND($B101=\"Y\",$C101=\"Y\",$G101=\"Y\",L101=L$3),1,\"\"))","v":""},{"$f":"IF(M$3=\"\",\"\",IF(AND($B101=\"Y\",$C101=\"Y\",$G101=\"Y\",M101=M$3),1,\"\"))","v":""},{"$f":"IF(N$3=\"\",\"\",IF(AND($B101=\"Y\",$C101=\"Y\",$G101=\"Y\",N101=N$3),1,\"\"))","v":""},{"$f":"IF(O$3=\"\",\"\",IF(AND($B101=\"Y\",$C101=\"Y\",$G101=\"Y\",O101=O$3),1,\"\"))","v":""},{"$f":"IF(P$3=\"\",\"\",IF(AND($B101=\"Y\",$C101=\"Y\",$G101=\"Y\",P101=P$3),1,\"\"))","v":""},{"$f":"IF(Q$3=\"\",\"\",IF(AND($B101=\"Y\",$C101=\"Y\",$G101=\"Y\",Q101=Q$3),1,\"\"))","v":""},{"$f":"IF(R$3=\"\",\"\",IF(AND($B101=\"Y\",$C101=\"Y\",$G101=\"Y\",R101=R$3),1,\"\"))","v":""},{"$f":"IF(S$3=\"\",\"\",IF(AND($B101=\"Y\",$C101=\"Y\",$G101=\"Y\",S101=S$3),1,\"\"))","v":""},{"$f":"IF(T$3=\"\",\"\",IF(AND($B101=\"Y\",$C101=\"Y\",$G101=\"Y\",T101=T$3),1,\"\"))","v":""},{"$f":"IF(U$3=\"\",\"\",IF(AND($B101=\"Y\",$C101=\"Y\",$G101=\"Y\",U101=U$3),1,\"\"))","v":""},{"$f":"IF(V$3=\"\",\"\",IF(AND($B101=\"Y\",$C101=\"Y\",$G101=\"Y\",V101=V$3),1,\"\"))","v":""},{"$f":"IF(W$3=\"\",\"\",IF(AND($B101=\"Y\",$C101=\"Y\",$G101=\"Y\",W101=W$3),1,\"\"))","v":""},{"$f":"IF(X$3=\"\",\"\",IF(AND($B101=\"Y\",$C101=\"Y\",$G101=\"Y\",X101=X$3),1,\"\"))","v":""},{"$f":"IF(Y$3=\"\",\"\",IF(AND($B101=\"Y\",$C101=\"Y\",$G101=\"Y\",Y101=Y$3),1,\"\"))","v":""},{"$f":"IF(B101<>\"Y\",\"\",IF(Z101=\"\",\"\",Z101*$E$3))","v":""}]
[97,{"$nulls":24},{"$f":"IF(SUM(AB102:AS102)=0,\"\",SUM(AB102:AS102))","v":""},null,{"$f":"IF(H$3=\"\",\"\",IF(AND($B102=\"Y\",$C102=\"Y\",$G102=\"Y\",H102=H$3),1,\"\"))","v":""},{"$f":"IF(I$3=\"\",\"\",IF(AND($B102=\"Y\",$C102=\"Y\",$G102=\"Y\",I102=I$3),1,\"\"))","v":""},{"$f":"IF(J$3=\"\",\"\",IF(AND($B102=\"Y\",$C102=\"Y\",$G102=\"Y\",J102=J$3),1,\"\"))","v":""},{"$f":"IF(K$3=\"\",\"\",IF(AND($B102=\"Y\",$C102=\"Y\",$G102=\"Y\",K102=K$3),1,\"\"))","v":""},{"$f":"IF(L$3=\"\",\"\",IF(AND($B102=\"Y\",$C102=\"Y\",$G102=\"Y\",L102=L$3),1,\"\"))","v":""},{"$f":"IF(M$3=\"\",\"\",IF(AND($B102=\"Y\",$C102=\"Y\",$G102=\"Y\",M102=M$3),1,\"\"))","v":""},{"$f":"IF(N$3=\"\",\"\",IF(AND($B102=\"Y\",$C102=\"Y\",$G102=\"Y\",N102=N$3),1,\"\"))","v":""},{"$f":"IF(O$3=\"\",\"\",IF(AND($B102=\"Y\",$C102=\"Y\",$G102=\"Y\",O102=O$3),1,\"\"))","v":""},{"$f":"IF(P$3=\"\",\"\",IF(AND($B102=\"Y\",$C102=\"Y\",$G102=\"Y\",P102=P$3),1,\"\"))","v":""},{"$f":"IF(Q$3=\"\",\"\",IF(AND($B102=\"Y\",$C102=\"Y\",$G102=\"Y\",Q102=Q$3),1,\"\"))","v":""},{"$f":"IF(R$3=\"\",\"\",IF(AND($B102=\"Y\",$C102=\"Y\",$G102=\"Y\",R102=R$3),1,\"\"))","v":""},{"$f":"IF(S$3=\"\",\"\",IF(AND($B102=\"Y\",$C102=\"Y\",$G102=\"Y\",S102=S$3),1,\"\"))","v":""},{"$f":"IF(T$3=\"\",\"\",IF(AND($B102=\"Y\",$C102=\"Y\",$G102=\"Y\",T102=T$3),1,\"\"))","v":""},{"$f":"IF(U$3=\"\",\"\",IF(AND($B102=\"Y\",$C102=\"Y\",$G102=\"Y\",U102=U$3),1,\"\"))","v":""},{"$f":"IF(V$3=\"\",\"\",IF(AND($B102=\"Y\",$C102=\"Y\",$G102=\"Y\",V102=V$3),1,\"\"))","v":""},{"$f":"IF(W$3=\"\",\"\",IF(AND($B102=\"Y\",$C102=\"Y\",$G102=\"Y\",W102=W$3),1,\"\"))","v":""},{"$f":"IF(X$3=\"\",\"\",IF(AND($B102=\"Y\",$C102=\"Y\",$G102=\"Y\",X102=X$3),1,\"\"))","v":""},{"$f":"IF(Y$3=\"\",\"\",IF(AND($B102=\"Y\",$C102=\"Y\",$G102=\"Y\",Y102=Y$3),1,\"\"))","v":""},{"$f":"IF(B102<>\"Y\",\"\",IF(Z102=\"\",\"\",Z102*$E$3))","v":""}]
[98,{"$nulls":24},{"$f":"IF(SUM(AB103:AS103)=0,\"\",SUM(AB103:AS103))","v":""},null,{"$f":"IF(H$3=\"\",\"\",IF(AND($B103=\"Y\",$C103=\"Y\",$G103=\"Y\",H103=H$3),1,\"\"))","v":""},{"$f":"IF(I$3=\"\",\"\",IF(AND($B103=\"Y\",$C103=\"Y\",$G103=\"Y\",I103=I$3),1,\"\"))","v":""},{"$f":"IF(J$3=\"\",\"\",IF(AND($B103=\"Y\",$C103=\"Y\",$G103=\"Y\",J103=J$3),1,\"\"))","v":""},{"$f":"IF(K$3=\"\",\"\",IF(AND($B103=\"Y\",$C103=\"Y\",$G103=\"Y\",K103=K$3),1,\"\"))","v":""},{"$f":"IF(L$3=\"\",\"\",IF(AND($B103=\"Y\",$C103=\"Y\",$G103=\"Y\",L103=L$3),1,\"\"))","v":""},{"$f":"IF(M$3=\"\",\"\",IF(AND($B103=\"Y\",$C103=\"Y\",$G103=\"Y\",M103=M$3),1,\"\"))","v":""},{"$f":"IF(N$3=\"\",\"\",IF(AND($B103=\"Y\",$C103=\"Y\",$G103=\"Y\",N103=N$3),1,\"\"))","v":""},{"$f":"IF(O$3=\"\",\"\",IF(AND($B103=\"Y\",$C103=\"Y\",$G103=\"Y\",O103=O$3),1,\"\"))","v":""},{"$f":"IF(P$3=\"\",\"\",IF(AND($B103=\"Y\",$C103=\"Y\",$G103=\"Y\",P103=P$3),1,\"\"))","v":""},{"$f":"IF(Q$3=\"\",\"\",IF(AND($B103=\"Y\",$C103=\"Y\",$G103=\"Y\",Q103=Q$3),1,\"\"))","v":""},{"$f":"IF(R$3=\"\",\"\",IF(AND($B103=\"Y\",$C103=\"Y\",$G103=\"Y\",R103=R$3),1,\"\"))","v":""},{"$f":"IF(S$3=\"\",\"\",IF(AND($B103=\"Y\",$C103=\"Y\",$G103=\"Y\",S103=S$3),1,\"\"))","v":""},{"$f":"IF(T$3=\"\",\"\",IF(AND($B103=\"Y\",$C103=\"Y\",$G103=\"Y\",T103=T$3),1,\"\"))","v":""},{"$f":"IF(U$3=\"\",\"\",IF(AND($B103=\"Y\",$C103=\"Y\",$G103=\"Y\",U103=U$3),1,\"\"))","v":""},{"$f":"IF(V$3=\"\",\"\",IF(AND($B103=\"Y\",$C103=\"Y\",$G103=\"Y\",V103=V$3),1,\"\"))","v":""},{"$f":"IF(W$3=\"\",\"\",IF(AND($B103=\"Y\",$C103=\"Y\",$G103=\"Y\",W103=W$3),1,\"\"))","v":""},{"$f":"IF(X$3=\"\",\"\",IF(AND($B103=\"Y\",$C103=\"Y\",$G103=\"Y\",X103=X$3),1,\"\"))","v":""},{"$f":"IF(Y$3=\"\",\"\",IF(AND($B103=\"Y\",$C103=\"Y\",$G103=\"Y\",Y103=Y$3),1,\"\"))","v":""},{"$f":"IF(B103<>\"Y\",\"\",IF(Z103=\"\",\"\",Z103*$E$3))","v":""}]
[99,{"$nulls":24},{"$f":"IF(SUM(AB104:AS104)=0,\"\",SUM(AB104:AS104))","v":""},null,{"$f":"IF(H$3=\"\",\"\",IF(AND($B104=\"Y\",$C104=\"Y\",$G104=\"Y\",H104=H$3),1,\"\"))","v":""},{"$f":"IF(I$3=\"\",\"\",IF(AND($B104=\"Y\",$C104=\"Y\",$G104=\"Y\",I104=I$3),1,\"\"))","v":""},{"$f":"IF(J$3=\"\",\"\",IF(AND($B104=\"Y\",$C104=\"Y\",$G104=\"Y\",J104=J$3),1,\"\"))","v":""},{"$f":"IF(K$3=\"\",\"\",IF(AND($B104=\"Y\",$C104=\"Y\",$G104=\"Y\",K104=K$3),1,\"\"))","v":""},{"$f":"IF(L$3=\"\",\"\",IF(AND($B104=\"Y\",$C104=\"Y\",$G104=\"Y\",L104=L$3),1,\"\"))","v":""},{"$f":"IF(M$3=\"\",\"\",IF(AND($B104=\"Y\",$C104=\"Y\",$G104=\"Y\",M104=M$3),1,\"\"))","v":""},{"$f":"IF(N$3=\"\",\"\",IF(AND($B104=\"Y\",$C104=\"Y\",$G104=\"Y\",N104=N$3),1,\"\"))","v":""},{"$f":"IF(O$3=\"\",\"\",IF(AND($B104=\"Y\",$C104=\"Y\",$G104=\"Y\",O104=O$3),1,\"\"))","v":""},{"$f":"IF(P$3=\"\",\"\",IF(AND($B104=\"Y\",$C104=\"Y\",$G104=\"Y\",P104=P$3),1,\"\"))","v":""},{"$f":"IF(Q$3=\"\",\"\",IF(AND($B104=\"Y\",$C104=\"Y\",$G104=\"Y\",Q104=Q$3),1,\"\"))","v":""},{"$f":"IF(R$3=\"\",\"\",IF(AND($B104=\"Y\",$C104=\"Y\",$G104=\"Y\",R104=R$3),1,\"\"))","v":""},{"$f":"IF(S$3=\"\",\"\",IF(AND($B104=\"Y\",$C104=\"Y\",$G104=\"Y\",S104=S$3),1,\"\"))","v":""},{"$f":"IF(T$3=\"\",\"\",IF(AND($B104=\"Y\",$C104=\"Y\",$G104=\"Y\",T104=T$3),1,\"\"))","v":""},{"$f":"IF(U$3=\"\",\"\",IF(AND($B104=\"Y\",$C104=\"Y\",$G104=\"Y\",U104=U$3),1,\"\"))","v":""},{"$f":"IF(V$3=\"\",\"\",IF(AND($B104=\"Y\",$C104=\"Y\",$G104=\"Y\",V104=V$3),1,\"\"))","v":""},{"$f":"IF(W$3=\"\",\"\",IF(AND($B104=\"Y\",$C104=\"Y\",$G104=\"Y\",W104=W$3),1,\"\"))","v":""},{"$f":"IF(X$3=\"\",\"\",IF(AND($B104=\"Y\",$C104=\"Y\",$G104=\"Y\",X104=X$3),1,\"\"))","v":""},{"$f":"IF(Y$3=\"\",\"\",IF(AND($B104=\"Y\",$C104=\"Y\",$G104=\"Y\",Y104=Y$3),1,\"\"))","v":""},{"$f":"IF(B104<>\"Y\",\"\",IF(Z104=\"\",\"\",Z104*$E$3))","v":""}]
[100,{"$nulls":24},{"$f":"IF(SUM(AB105:AS105)=0,\"\",SUM(AB105:AS105))","v":""},null,{"$f":"IF(H$3=\"\",\"\",IF(AND($B105=\"Y\",$C105=\"Y\",$G105=\"Y\",H105=H$3),1,\"\"))","v":""},{"$f":"IF(I$3=\"\",\"\",IF(AND($B105=\"Y\",$C105=\"Y\",$G105=\"Y\",I105=I$3),1,\"\"))","v":""},{"$f":"IF(J$3=\"\",\"\",IF(AND($B105=\"Y\",$C105=\"Y\",$G105=\"Y\",J105=J$3),1,\"\"))","v":""},{"$f":"IF(K$3=\"\",\"\",IF(AND($B105=\"Y\",$C105=\"Y\",$G105=\"Y\",K105=K$3),1,\"\"))","v":""},{"$f":"IF(L$3=\"\",\"\",IF(AND($B105=\"Y\",$C105=\"Y\",$G105=\"Y\",L105=L$3),1,\"\"))","v":""},{"$f":"IF(M$3=\"\",\"\",IF(AND($B105=\"Y\",$C105=\"Y\",$G105=\"Y\",M105=M$3),1,\"\"))","v":""},{"$f":"IF(N$3=\"\",\"\",IF(AND($B105=\"Y\",$C105=\"Y\",$G105=\"Y\",N105=N$3),1,\"\"))","v":""},{"$f":"IF(O$3=\"\",\"\",IF(AND($B105=\"Y\",$C105=\"Y\",$G105=\"Y\",O105=O$3),1,\"\"))","v":""},{"$f":"IF(P$3=\"\",\"\",IF(AND($B105=\"Y\",$C105=\"Y\",$G105=\"Y\",P105=P$3),1,\"\"))","v":""},{"$f":"IF(Q$3=\"\",\"\",IF(AND($B105=\"Y\",$C105=\"Y\",$G105=\"Y\",Q105=Q$3),1,\"\"))","v":""},{"$f":"IF(R$3=\"\",\"\",IF(AND($B105=\"Y\",$C105=\"Y\",$G105=\"Y\",R105=R$3),1,\"\"))","v":""},{"$f":"IF(S$3=\"\",\"\",IF(AND($B105=\"Y\",$C105=\"Y\",$G105=\"Y\",S105=S$3),1,\"\"))","v":""},{"$f":"IF(T$3=\"\",\"\",IF(AND($B105=\"Y\",$C105=\"Y\",$G105=\"Y\",T105=T$3),1,\"\"))","v":""},{"$f":"IF(U$3=\"\",\"\",IF(AND($B105=\"Y\",$C105=\"Y\",$G105=\"Y\",U105=U$3),1,\"\"))","v":""},{"$f":"IF(V$3=\"\",\"\",IF(AND($B105=\"Y\",$C105=\"Y\",$G105=\"Y\",V105=V$3),1,\"\"))","v":""},{"$f":"IF(W$3=\"\",\"\",IF(AND($B105=\"Y\",$C105=\"Y\",$G105=\"Y\",W105=W$3),1,\"\"))","v":""},{"$f":"IF(X$3=\"\",\"\",IF(AND($B105=\"Y\",$C105=\"Y\",$G105=\"Y\",X105=X$3),1,\"\"))","v":""},{"$f":"IF(Y$3=\"\",\"\",IF(AND($B105=\"Y\",$C105=\"Y\",$G105=\"Y\",Y105=Y$3),1,\"\"))","v":""},{"$f":"IF(B105<>\"Y\",\"\",IF(Z105=\"\",\"\",Z105*$E$3))","v":""}]
[101,{"$nulls":24},{"$f":"IF(SUM(AB106:AS106)=0,\"\",SUM(AB106:AS106))","v":""},null,{"$f":"IF(H$3=\"\",\"\",IF(AND($B106=\"Y\",$C106=\"Y\",$G106=\"Y\",H106=H$3),1,\"\"))","v":""},{"$f":"IF(I$3=\"\",\"\",IF(AND($B106=\"Y\",$C106=\"Y\",$G106=\"Y\",I106=I$3),1,\"\"))","v":""},{"$f":"IF(J$3=\"\",\"\",IF(AND($B106=\"Y\",$C106=\"Y\",$G106=\"Y\",J106=J$3),1,\"\"))","v":""},{"$f":"IF(K$3=\"\",\"\",IF(AND($B106=\"Y\",$C106=\"Y\",$G106=\"Y\",K106=K$3),1,\"\"))","v":""},{"$f":"IF(L$3=\"\",\"\",IF(AND($B106=\"Y\",$C106=\"Y\",$G106=\"Y\",L106=L$3),1,\"\"))","v":""},{"$f":"IF(M$3=\"\",\"\",IF(AND($B106=\"Y\",$C106=\"Y\",$G106=\"Y\",M106=M$3),1,\"\"))","v":""},{"$f":"IF(N$3=\"\",\"\",IF(AND($B106=\"Y\",$C106=\"Y\",$G106=\"Y\",N106=N$3),1,\"\"))","v":""},{"$f":"IF(O$3=\"\",\"\",IF(AND($B106=\"Y\",$C106=\"Y\",$G106=\"Y\",O106=O$3),1,\"\"))","v":""},{"$f":"IF(P$3=\"\",\"\",IF(AND($B106=\"Y\",$C106=\"Y\",$G106=\"Y\",P106=P$3),1,\"\"))","v":""},{"$f":"IF(Q$3=\"\",\"\",IF(AND($B106=\"Y\",$C106=\"Y\",$G106=\"Y\",Q106=Q$3),1,\"\"))","v":""},{"$f":"IF(R$3=\"\",\"\",IF(AND($B106=\"Y\",$C106=\"Y\",$G106=\"Y\",R106=R$3),1,\"\"))","v":""},{"$f":"IF(S$3=\"\",\"\",IF(AND($B106=\"Y\",$C106=\"Y\",$G106=\"Y\",S106=S$3),1,\"\"))","v":""},{"$f":"IF(T$3=\"\",\"\",IF(AND($B106=\"Y\",$C106=\"Y\",$G106=\"Y\",T106=T$3),1,\"\"))","v":""},{"$f":"IF(U$3=\"\",\"\",IF(AND($B106=\"Y\",$C106=\"Y\",$G106=\"Y\",U106=U$3),1,\"\"))","v":""},{"$f":"IF(V$3=\"\",\"\",IF(AND($B106=\"Y\",$C106=\"Y\",$G106=\"Y\",V106=V$3),1,\"\"))","v":""},{"$f":"IF(W$3=\"\",\"\",IF(AND($B106=\"Y\",$C106=\"Y\",$G106=\"Y\",W106=W$3),1,\"\"))","v":""},{"$f":"IF(X$3=\"\",\"\",IF(AND($B106=\"Y\",$C106=\"Y\",$G106=\"Y\",X106=X$3),1,\"\"))","v":""},{"$f":"IF(Y$3=\"\",\"\",IF(AND($B106=\"Y\",$C106=\"Y\",$G106=\"Y\",Y106=Y$3),1,\"\"))","v":""},{"$f":"IF(B106<>\"Y\",\"\",IF(Z106=\"\",\"\",Z106*$E$3))","v":""}]
[102,{"$nulls":24},{"$f":"IF(SUM(AB107:AS107)=0,\"\",SUM(AB107:AS107))","v":""},null,{"$f":"IF(H$3=\"\",\"\",IF(AND($B107=\"Y\",$C107=\"Y\",$G107=\"Y\",H107=H$3),1,\"\"))","v":""},{"$f":"IF(I$3=\"\",\"\",IF(AND($B107=\"Y\",$C107=\"Y\",$G107=\"Y\",I107=I$3),1,\"\"))","v":""},{"$f":"IF(J$3=\"\",\"\",IF(AND($B107=\"Y\",$C107=\"Y\",$G107=\"Y\",J107=J$3),1,\"\"))","v":""},{"$f":"IF(K$3=\"\",\"\",IF(AND($B107=\"Y\",$C107=\"Y\",$G107=\"Y\",K107=K$3),1,\"\"))","v":""},{"$f":"IF(L$3=\"\",\"\",IF(AND($B107=\"Y\",$C107=\"Y\",$G107=\"Y\",L107=L$3),1,\"\"))","v":""},{"$f":"IF(M$3=\"\",\"\",IF(AND($B107=\"Y\",$C107=\"Y\",$G107=\"Y\",M107=M$3),1,\"\"))","v":""},{"$f":"IF(N$3=\"\",\"\",IF(AND($B107=\"Y\",$C107=\"Y\",$G107=\"Y\",N107=N$3),1,\"\"))","v":""},{"$f":"IF(O$3=\"\",\"\",IF(AND($B107=\"Y\",$C107=\"Y\",$G107=\"Y\",O107=O$3),1,\"\"))","v":""},{"$f":"IF(P$3=\"\",\"\",IF(AND($B107=\"Y\",$C107=\"Y\",$G107=\"Y\",P107=P$3),1,\"\"))","v":""},{"$f":"IF(Q$3=\"\",\"\",IF(AND($B107=\"Y\",$C107=\"Y\",$G107=\"Y\",Q107=Q$3),1,\"\"))","v":""},{"$f":"IF(R$3=\"\",\"\",IF(AND($B107=\"Y\",$C107=\"Y\",$G107=\"Y\",R107=R$3),1,\"\"))","v":""},{"$f":"IF(S$3=\"\",\"\",IF(AND($B107=\"Y\",$C107=\"Y\",$G107=\"Y\",S107=S$3),1,\"\"))","v":""},{"$f":"IF(T$3=\"\",\"\",IF(AND($B107=\"Y\",$C107=\"Y\",$G107=\"Y\",T107=T$3),1,\"\"))","v":""},{"$f":"IF(U$3=\"\",\"\",IF(AND($B107=\"Y\",$C107=\"Y\",$G107=\"Y\",U107=U$3),1,\"\"))","v":""},{"$f":"IF(V$3=\"\",\"\",IF(AND($B107=\"Y\",$C107=\"Y\",$G107=\"Y\",V107=V$3),1,\"\"))","v":""},{"$f":"IF(W$3=\"\",\"\",IF(AND($B107=\"Y\",$C107=\"Y\",$G107=\"Y\",W107=W$3),1,\"\"))","v":""},{"$f":"IF(X$3=\"\",\"\",IF(AND($B107=\"Y\",$C107=\"Y\",$G107=\"Y\",X107=X$3),1,\"\"))","v":""},{"$f":"IF(Y$3=\"\",\"\",IF(AND($B107=\"Y\",$C107=\"Y\",$G107=\"Y\",Y107=Y$3),1,\"\"))","v":""},{"$f":"IF(B107<>\"Y\",\"\",IF(Z107=\"\",\"\",Z107*$E$3))","v":""}]
[103,{"$nulls":24},{"$f":"IF(SUM(AB108:AS108)=0,\"\",SUM(AB108:AS108))","v":""},null,{"$f":"IF(H$3=\"\",\"\",IF(AND($B108=\"Y\",$C108=\"Y\",$G108=\"Y\",H108=H$3),1,\"\"))","v":""},{"$f":"IF(I$3=\"\",\"\",IF(AND($B108=\"Y\",$C108=\"Y\",$G108=\"Y\",I108=I$3),1,\"\"))","v":""},{"$f":"IF(J$3=\"\",\"\",IF(AND($B108=\"Y\",$C108=\"Y\",$G108=\"Y\",J108=J$3),1,\"\"))","v":""},{"$f":"IF(K$3=\"\",\"\",IF(AND($B108=\"Y\",$C108=\"Y\",$G108=\"Y\",K108=K$3),1,\"\"))","v":""},{"$f":"IF(L$3=\"\",\"\",IF(AND($B108=\"Y\",$C108=\"Y\",$G108=\"Y\",L108=L$3),1,\"\"))","v":""},{"$f":"IF(M$3=\"\",\"\",IF(AND($B108=\"Y\",$C108=\"Y\",$G108=\"Y\",M108=M$3),1,\"\"))","v":""},{"$f":"IF(N$3=\"\",\"\",IF(AND($B108=\"Y\",$C108=\"Y\",$G108=\"Y\",N108=N$3),1,\"\"))","v":""},{"$f":"IF(O$3=\"\",\"\",IF(AND($B108=\"Y\",$C108=\"Y\",$G108=\"Y\",O108=O$3),1,\"\"))","v":""},{"$f":"IF(P$3=\"\",\"\",IF(AND($B108=\"Y\",$C108=\"Y\",$G108=\"Y\",P108=P$3),1,\"\"))","v":""},{"$f":"IF(Q$3=\"\",\"\",IF(AND($B108=\"Y\",$C108=\"Y\",$G108=\"Y\",Q108=Q$3),1,\"\"))","v":""},{"$f":"IF(R$3=\"\",\"\",IF(AND($B108=\"Y\",$C108=\"Y\",$G108=\"Y\",R108=R$3),1,\"\"))","v":""},{"$f":"IF(S$3=\"\",\"\",IF(AND($B108=\"Y\",$C108=\"Y\",$G108=\"Y\",S108=S$3),1,\"\"))","v":""},{"$f":"IF(T$3=\"\",\"\",IF(AND($B108=\"Y\",$C108=\"Y\",$G108=\"Y\",T108=T$3),1,\"\"))","v":""},{"$f":"IF(U$3=\"\",\"\",IF(AND($B108=\"Y\",$C108=\"Y\",$G108=\"Y\",U108=U$3),1,\"\"))","v":""},{"$f":"IF(V$3=\"\",\"\",IF(AND($B108=\"Y\",$C108=\"Y\",$G108=\"Y\",V108=V$3),1,\"\"))","v":""},{"$f":"IF(W$3=\"\",\"\",IF(AND($B108=\"Y\",$C108=\"Y\",$G108=\"Y\",W108=W$3),1,\"\"))","v":""},{"$f":"IF(X$3=\"\",\"\",IF(AND($B108=\"Y\",$C108=\"Y\",$G108=\"Y\",X108=X$3),1,\"\"))","v":""},{"$f":"IF(Y$3=\"\",\"\",IF(AND($B108=\"Y\",$C108=\"Y\",$G108=\"Y\",Y108=Y$3),1,\"\"))","v":""},{"$f":"IF(B108<>\"Y\",\"\",IF(Z108=\"\",\"\",Z108*$E$3))","v":""}]
[104,{"$nulls":24},{"$f":"IF(SUM(AB109:AS109)=0,\"\",SUM(AB109:AS109))","v":""},null,{"$f":"IF(H$3=\"\",\"\",IF(AND($B109=\"Y\",$C109=\"Y\",$G109=\"Y\",H109=H$3),1,\"\"))","v":""},{"$f":"IF(I$3=\"\",\"\",IF(AND($B109=\"Y\",$C109=\"Y\",$G109=\"Y\",I109=I$3),1,\"\"))","v":""},{"$f":"IF(J$3=\"\",\"\",IF(AND($B109=\"Y\",$C109=\"Y\",$G109=\"Y\",J109=J$3),1,\"\"))","v":""},{"$f":"IF(K$3=\"\",\"\",IF(AND($B109=\"Y\",$C109=\"Y\",$G109=\"Y\",K109=K$3),1,\"\"))","v":""},{"$f":"IF(L$3=\"\",\"\",IF(AND($B109=\"Y\",$C109=\"Y\",$G109=\"Y\",L109=L$3),1,\"\"))","v":""},{"$f":"IF(M$3=\"\",\"\",IF(AND($B109=\"Y\",$C109=\"Y\",$G109=\"Y\",M109=M$3),1,\"\"))","v":""},{"$f":"IF(N$3=\"\",\"\",IF(AND($B109=\"Y\",$C109=\"Y\",$G109=\"Y\",N109=N$3),1,\"\"))","v":""},{"$f":"IF(O$3=\"\",\"\",IF(AND($B109=\"Y\",$C109=\"Y\",$G109=\"Y\",O109=O$3),1,\"\"))","v":""},{"$f":"IF(P$3=\"\",\"\",IF(AND($B109=\"Y\",$C109=\"Y\",$G109=\"Y\",P109=P$3),1,\"\"))","v":""},{"$f":"IF(Q$3=\"\",\"\",IF(AND($B109=\"Y\",$C109=\"Y\",$G109=\"Y\",Q109=Q$3),1,\"\"))","v":""},{"$f":"IF(R$3=\"\",\"\",IF(AND($B109=\"Y\",$C109=\"Y\",$G109=\"Y\",R109=R$3),1,\"\"))","v":""},{"$f":"IF(S$3=\"\",\"\",IF(AND($B109=\"Y\",$C109=\"Y\",$G109=\"Y\",S109=S$3),1,\"\"))","v":""},{"$f":"IF(T$3=\"\",\"\",IF(AND($B109=\"Y\",$C109=\"Y\",$G109=\"Y\",T109=T$3),1,\"\"))","v":""},{"$f":"IF(U$3=\"\",\"\",IF(AND($B109=\"Y\",$C109=\"Y\",$G109=\"Y\",U109=U$3),1,\"\"))","v":""},{"$f":"IF(V$3=\"\",\"\",IF(AND($B109=\"Y\",$C109=\"Y\",$G109=\"Y\",V109=V$3),1,\"\"))","v":""},{"$f":"IF(W$3=\"\",\"\",IF(AND($B109=\"Y\",$C109=\"Y\",$G109=\"Y\",W109=W$3),1,\"\"))","v":""},{"$f":"IF(X$3=\"\",\"\",IF(AND($B109=\"Y\",$C109=\"Y\",$G109=\"Y\",X109=X$3),1,\"\"))","v":""},{"$f":"IF(Y$3=\"\",\"\",IF(AND($B109=\"Y\",$C109=\"Y\",$G109=\"Y\",Y109=Y$3),1,\"\"))","v":""},{"$f":"IF(B109<>\"Y\",\"\",IF(Z109=\"\",\"\",Z109*$E$3))","v":""}]
[105,{"$nulls":24},{"$f":"IF(SUM(AB110:AS110)=0,\"\",SUM(AB110:AS110))","v":""},null,{"$f":"IF(H$3=\"\",\"\",IF(AND($B110=\"Y\",$C110=\"Y\",$G110=\"Y\",H110=H$3),1,\"\"))","v":""},{"$f":"IF(I$3=\"\",\"\",IF(AND($B110=\"Y\",$C110=\"Y\",$G110=\"Y\",I110=I$3),1,\"\"))","v":""},{"$f":"IF(J$3=\"\",\"\",IF(AND($B110=\"Y\",$C110=\"Y\",$G110=\"Y\",J110=J$3),1,\"\"))","v":""},{"$f":"IF(K$3=\"\",\"\",IF(AND($B110=\"Y\",$C110=\"Y\",$G110=\"Y\",K110=K$3),1,\"\"))","v":""},{"$f":"IF(L$3=\"\",\"\",IF(AND($B110=\"Y\",$C110=\"Y\",$G110=\"Y\",L110=L$3),1,\"\"))","v":""},{"$f":"IF(M$3=\"\",\"\",IF(AND($B110=\"Y\",$C110=\"Y\",$G110=\"Y\",M110=M$3),1,\"\"))","v":""},{"$f":"IF(N$3=\"\",\"\",IF(AND($B110=\"Y\",$C110=\"Y\",$G110=\"Y\",N110=N$3),1,\"\"))","v":""},{"$f":"IF(O$3=\"\",\"\",IF(AND($B110=\"Y\",$C110=\"Y\",$G110=\"Y\",O110=O$3),1,\"\"))","v":""},{"$f":"IF(P$3=\"\",\"\",IF(AND($B110=\"Y\",$C110=\"Y\",$G110=\"Y\",P110=P$3),1,\"\"))","v":""},{"$f":"IF(Q$3=\"\",\"\",IF(AND($B110=\"Y\",$C110=\"Y\",$G110=\"Y\",Q110=Q$3),1,\"\"))","v":""},{"$f":"IF(R$3=\"\",\"\",IF(AND($B110=\"Y\",$C110=\"Y\",$G110=\"Y\",R110=R$3),1,\"\"))","v":""},{"$f":"IF(S$3=\"\",\"\",IF(AND($B110=\"Y\",$C110=\"Y\",$G110=\"Y\",S110=S$3),1,\"\"))","v":""},{"$f":"IF(T$3=\"\",\"\",IF(AND($B110=\"Y\",$C110=\"Y\",$G110=\"Y\",T110=T$3),1,\"\"))","v":""},{"$f":"IF(U$3=\"\",\"\",IF(AND($B110=\"Y\",$C110=\"Y\",$G110=\"Y\",U110=U$3),1,\"\"))","v":""},{"$f":"IF(V$3=\"\",\"\",IF(AND($B110=\"Y\",$C110=\"Y\",$G110=\"Y\",V110=V$3),1,\"\"))","v":""},{"$f":"IF(W$3=\"\",\"\",IF(AND($B110=\"Y\",$C110=\"Y\",$G110=\"Y\",W110=W$3),1,\"\"))","v":""},{"$f":"IF(X$3=\"\",\"\",IF(AND($B110=\"Y\",$C110=\"Y\",$G110=\"Y\",X110=X$3),1,\"\"))","v":""},{"$f":"IF(Y$3=\"\",\"\",IF(AND($B110=\"Y\",$C110=\"Y\",$G110=\"Y\",Y110=Y$3),1,\"\"))","v":""},{"$f":"IF(B110<>\"Y\",\"\",IF(Z110=\"\",\"\",Z110*$E$3))","v":""}]
[106,{"$nulls":24},{"$f":"IF(SUM(AB111:AS111)=0,\"\",SUM(AB111:AS111))","v":""},null,{"$f":"IF(H$3=\"\",\"\",IF(AND($B111=\"Y\",$C111=\"Y\",$G111=\"Y\",H111=H$3),1,\"\"))","v":""},{"$f":"IF(I$3=\"\",\"\",IF(AND($B111=\"Y\",$C111=\"Y\",$G111=\"Y\",I111=I$3),1,\"\"))","v":""},{"$f":"IF(J$3=\"\",\"\",IF(AND($B111=\"Y\",$C111=\"Y\",$G111=\"Y\",J111=J$3),1,\"\"))","v":""},{"$f":"IF(K$3=\"\",\"\",IF(AND($B111=\"Y\",$C111=\"Y\",$G111=\"Y\",K111=K$3),1,\"\"))","v":""},{"$f":"IF(L$3=\"\",\"\",IF(AND($B111=\"Y\",$C111=\"Y\",$G111=\"Y\",L111=L$3),1,\"\"))","v":""},{"$f":"IF(M$3=\"\",\"\",IF(AND($B111=\"Y\",$C111=\"Y\",$G111=\"Y\",M111=M$3),1,\"\"))","v":""},{"$f":"IF(N$3=\"\",\"\",IF(AND($B111=\"Y\",$C111=\"Y\",$G111=\"Y\",N111=N$3),1,\"\"))","v":""},{"$f":"IF(O$3=\"\",\"\",IF(AND($B111=\"Y\",$C111=\"Y\",$G111=\"Y\",O111=O$3),1,\"\"))","v":""},{"$f":"IF(P$3=\"\",\"\",IF(AND($B111=\"Y\",$C111=\"Y\",$G111=\"Y\",P111=P$3),1,\"\"))","v":""},{"$f":"IF(Q$3=\"\",\"\",IF(AND($B111=\"Y\",$C111=\"Y\",$G111=\"Y\",Q111=Q$3),1,\"\"))","v":""},{"$f":"IF(R$3=\"\",\"\",IF(AND($B111=\"Y\",$C111=\"Y\",$G111=\"Y\",R111=R$3),1,\"\"))","v":""},{"$f":"IF(S$3=\"\",\"\",IF(AND($B111=\"Y\",$C111=\"Y\",$G111=\"Y\",S111=S$3),1,\"\"))","v":""},{"$f":"IF(T$3=\"\",\"\",IF(AND($B111=\"Y\",$C111=\"Y\",$G111=\"Y\",T111=T$3),1,\"\"))","v":""},{"$f":"IF(U$3=\"\",\"\",IF(AND($B111=\"Y\",$C111=\"Y\",$G111=\"Y\",U111=U$3),1,\"\"))","v":""},{"$f":"IF(V$3=\"\",\"\",IF(AND($B111=\"Y\",$C111=\"Y\",$G111=\"Y\",V111=V$3),1,\"\"))","v":""},{"$f":"IF(W$3=\"\",\"\",IF(AND($B111=\"Y\",$C111=\"Y\",$G111=\"Y\",W111=W$3),1,\"\"))","v":""},{"$f":"IF(X$3=\"\",\"\",IF(AND($B111=\"Y\",$C111=\"Y\",$G111=\"Y\",X111=X$3),1,\"\"))","v":""},{"$f":"IF(Y$3=\"\",\"\",IF(AND($B111=\"Y\",$C111=\"Y\",$G111=\"Y\",Y111=Y$3),1,\"\"))","v":""},{"$f":"IF(B111<>\"Y\",\"\",IF(Z111=\"\",\"\",Z111*$E$3))","v":""}]
[107,{"$nulls":24},{"$f":"IF(SUM(AB112:AS112)=0,\"\",SUM(AB112:AS112))","v":""},null,{"$f":"IF(H$3=\"\",\"\",IF(AND($B112=\"Y\",$C112=\"Y\",$G112=\"Y\",H112=H$3),1,\"\"))","v":""},{"$f":"IF(I$3=\"\",\"\",IF(AND($B112=\"Y\",$C112=\"Y\",$G112=\"Y\",I112=I$3),1,\"\"))","v":""},{"$f":"IF(J$3=\"\",\"\",IF(AND($B112=\"Y\",$C112=\"Y\",$G112=\"Y\",J112=J$3),1,\"\"))","v":""},{"$f":"IF(K$3=\"\",\"\",IF(AND($B112=\"Y\",$C112=\"Y\",$G112=\"Y\",K112=K$3),1,\"\"))","v":""},{"$f":"IF(L$3=\"\",\"\",IF(AND($B112=\"Y\",$C112=\"Y\",$G112=\"Y\",L112=L$3),1,\"\"))","v":""},{"$f":"IF(M$3=\"\",\"\",IF(AND($B112=\"Y\",$C112=\"Y\",$G112=\"Y\",M112=M$3),1,\"\"))","v":""},{"$f":"IF(N$3=\"\",\"\",IF(AND($B112=\"Y\",$C112=\"Y\",$G112=\"Y\",N112=N$3),1,\"\"))","v":""},{"$f":"IF(O$3=\"\",\"\",IF(AND($B112=\"Y\",$C112=\"Y\",$G112=\"Y\",O112=O$3),1,\"\"))","v":""},{"$f":"IF(P$3=\"\",\"\",IF(AND($B112=\"Y\",$C112=\"Y\",$G112=\"Y\",P112=P$3),1,\"\"))","v":""},{"$f":"IF(Q$3=\"\",\"\",IF(AND($B112=\"Y\",$C112=\"Y\",$G112=\"Y\",Q112=Q$3),1,\"\"))","v":""},{"$f":"IF(R$3=\"\",\"\",IF(AND($B112=\"Y\",$C112=\"Y\",$G112=\"Y\",R112=R$3),1,\"\"))","v":""},{"$f":"IF(S$3=\"\",\"\",IF(AND($B112=\"Y\",$C112=\"Y\",$G112=\"Y\",S112=S$3),1,\"\"))","v":""},{"$f":"IF(T$3=\"\",\"\",IF(AND($B112=\"Y\",$C112=\"Y\",$G112=\"Y\",T112=T$3),1,\"\"))","v":""},{"$f":"IF(U$3=\"\",\"\",IF(AND($B112=\"Y\",$C112=\"Y\",$G112=\"Y\",U112=U$3),1,\"\"))","v":""},{"$f":"IF(V$3=\"\",\"\",IF(AND($B112=\"Y\",$C112=\"Y\",$G112=\"Y\",V112=V$3),1,\"\"))","v":""},{"$f":"IF(W$3=\"\",\"\",IF(AND($B112=\"Y\",$C112=\"Y\",$G112=\"Y\",W112=W$3),1,\"\"))","v":""},{"$f":"IF(X$3=\"\",\"\",IF(AND($B112=\"Y\",$C112=\"Y\",$G112=\"Y\",X112=X$3),1,\"\"))","v":""},{"$f":"IF(Y$3=\"\",\"\",IF(AND($B112=\"Y\",$C112=\"Y\",$G112=\"Y\",Y112=Y$3),1,\"\"))","v":""},{"$f":"IF(B112<>\"Y\",\"\",IF(Z112=\"\",\"\",Z112*$E$3))","v":""}]
[108,{"$nulls":24},{"$f":"IF(SUM(AB113:AS113)=0,\"\",SUM(AB113:AS113))","v":""},null,{"$f":"IF(H$3=\"\",\"\",IF(AND($B113=\"Y\",$C113=\"Y\",$G113=\"Y\",H113=H$3),1,\"\"))","v":""},{"$f":"IF(I$3=\"\",\"\",IF(AND($B113=\"Y\",$C113=\"Y\",$G113=\"Y\",I113=I$3),1,\"\"))","v":""},{"$f":"IF(J$3=\"\",\"\",IF(AND($B113=\"Y\",$C113=\"Y\",$G113=\"Y\",J113=J$3),1,\"\"))","v":""},{"$f":"IF(K$3=\"\",\"\",IF(AND($B113=\"Y\",$C113=\"Y\",$G113=\"Y\",K113=K$3),1,\"\"))","v":""},{"$f":"IF(L$3=\"\",\"\",IF(AND($B113=\"Y\",$C113=\"Y\",$G113=\"Y\",L113=L$3),1,\"\"))","v":""},{"$f":"IF(M$3=\"\",\"\",IF(AND($B113=\"Y\",$C113=\"Y\",$G113=\"Y\",M113=M$3),1,\"\"))","v":""},{"$f":"IF(N$3=\"\",\"\",IF(AND($B113=\"Y\",$C113=\"Y\",$G113=\"Y\",N113=N$3),1,\"\"))","v":""},{"$f":"IF(O$3=\"\",\"\",IF(AND($B113=\"Y\",$C113=\"Y\",$G113=\"Y\",O113=O$3),1,\"\"))","v":""},{"$f":"IF(P$3=\"\",\"\",IF(AND($B113=\"Y\",$C113=\"Y\",$G113=\"Y\",P113=P$3),1,\"\"))","v":""},{"$f":"IF(Q$3=\"\",\"\",IF(AND($B113=\"Y\",$C113=\"Y\",$G113=\"Y\",Q113=Q$3),1,\"\"))","v":""},{"$f":"IF(R$3=\"\",\"\",IF(AND($B113=\"Y\",$C113=\"Y\",$G113=\"Y\",R113=R$3),1,\"\"))","v":""},{"$f":"IF(S$3=\"\",\"\",IF(AND($B113=\"Y\",$C113=\"Y\",$G113=\"Y\",S113=S$3),1,\"\"))","v":""},{"$f":"IF(T$3=\"\",\"\",IF(AND($B113=\"Y\",$C113=\"Y\",$G113=\"Y\",T113=T$3),1,\"\"))","v":""},{"$f":"IF(U$3=\"\",\"\",IF(AND($B113=\"Y\",$C113=\"Y\",$G113=\"Y\",U113=U$3),1,\"\"))","v":""},{"$f":"IF(V$3=\"\",\"\",IF(AND($B113=\"Y\",$C113=\"Y\",$G113=\"Y\",V113=V$3),1,\"\"))","v":""},{"$f":"IF(W$3=\"\",\"\",IF(AND($B113=\"Y\",$C113=\"Y\",$G113=\"Y\",W113=W$3),1,\"\"))","v":""},{"$f":"IF(X$3=\"\",\"\",IF(AND($B113=\"Y\",$C113=\"Y\",$G113=\"Y\",X113=X$3),1,\"\"))","v":""},{"$f":"IF(Y$3=\"\",\"\",IF(AND($B113=\"Y\",$C113=\"Y\",$G113=\"Y\",Y113=Y$3),1,\"\"))","v":""},{"$f":"IF(B113<>\"Y\",\"\",IF(Z113=\"\",\"\",Z113*$E$3))","v":""}]
[109,{"$nulls":24},{"$f":"IF(SUM(AB114:AS114)=0,\"\",SUM(AB114:AS114))","v":""},null,{"$f":"IF(H$3=\"\",\"\",IF(AND($B114=\"Y\",$C114=\"Y\",$G114=\"Y\",H114=H$3),1,\"\"))","v":""},{"$f":"IF(I$3=\"\",\"\",IF(AND($B114=\"Y\",$C114=\"Y\",$G114=\"Y\",I114=I$3),1,\"\"))","v":""},{"$f":"IF(J$3=\"\",\"\",IF(AND($B114=\"Y\",$C114=\"Y\",$G114=\"Y\",J114=J$3),1,\"\"))","v":""},{"$f":"IF(K$3=\"\",\"\",IF(AND($B114=\"Y\",$C114=\"Y\",$G114=\"Y\",K114=K$3),1,\"\"))","v":""},{"$f":"IF(L$3=\"\",\"\",IF(AND($B114=\"Y\",$C114=\"Y\",$G114=\"Y\",L114=L$3),1,\"\"))","v":""},{"$f":"IF(M$3=\"\",\"\",IF(AND($B114=\"Y\",$C114=\"Y\",$G114=\"Y\",M114=M$3),1,\"\"))","v":""},{"$f":"IF(N$3=\"\",\"\",IF(AND($B114=\"Y\",$C114=\"Y\",$G114=\"Y\",N114=N$3),1,\"\"))","v":""},{"$f":"IF(O$3=\"\",\"\",IF(AND($B114=\"Y\",$C114=\"Y\",$G114=\"Y\",O114=O$3),1,\"\"))","v":""},{"$f":"IF(P$3=\"\",\"\",IF(AND($B114=\"Y\",$C114=\"Y\",$G114=\"Y\",P114=P$3),1,\"\"))","v":""},{"$f":"IF(Q$3=\"\",\"\",IF(AND($B114=\"Y\",$C114=\"Y\",$G114=\"Y\",Q114=Q$3),1,\"\"))","v":""},{"$f":"IF(R$3=\"\",\"\",IF(AND($B114=\"Y\",$C114=\"Y\",$G114=\"Y\",R114=R$3),1,\"\"))","v":""},{"$f":"IF(S$3=\"\",\"\",IF(AND($B114=\"Y\",$C114=\"Y\",$G114=\"Y\",S114=S$3),1,\"\"))","v":""},{"$f":"IF(T$3=\"\",\"\",IF(AND($B114=\"Y\",$C114=\"Y\",$G114=\"Y\",T114=T$3),1,\"\"))","v":""},{"$f":"IF(U$3=\"\",\"\",IF(AND($B114=\"Y\",$C114=\"Y\",$G114=\"Y\",U114=U$3),1,\"\"))","v":""},{"$f":"IF(V$3=\"\",\"\",IF(AND($B114=\"Y\",$C114=\"Y\",$G114=\"Y\",V114=V$3),1,\"\"))","v":""},{"$f":"IF(W$3=\"\",\"\",IF(AND($B114=\"Y\",$C114=\"Y\",$G114=\"Y\",W114=W$3),1,\"\"))","v":""},{"$f":"IF(X$3=\"\",\"\",IF(AND($B114=\"Y\",$C114=\"Y\",$G114=\"Y\",X114=X$3),1,\"\"))","v":""},{"$f":"IF(Y$3=\"\",\"\",IF(AND($B114=\"Y\",$C114=\"Y\",$G114=\"Y\",Y114=Y$3),1,\"\"))","v":""},{"$f":"IF(B114<>\"Y\",\"\",IF(Z114=\"\",\"\",Z114*$E$3))","v":""}]
[110,{"$nulls":24},{"$f":"IF(SUM(AB115:AS115)=0,\"\",SUM(AB115:AS115))","v":""},null,{"$f":"IF(H$3=\"\",\"\",IF(AND($B115=\"Y\",$C115=\"Y\",$G115=\"Y\",H115=H$3),1,\"\"))","v":""},{"$f":"IF(I$3=\"\",\"\",IF(AND($B115=\"Y\",$C115=\"Y\",$G115=\"Y\",I115=I$3),1,\"\"))","v":""},{"$f":"IF(J$3=\"\",\"\",IF(AND($B115=\"Y\",$C115=\"Y\",$G115=\"Y\",J115=J$3),1,\"\"))","v":""},{"$f":"IF(K$3=\"\",\"\",IF(AND($B115=\"Y\",$C115=\"Y\",$G115=\"Y\",K115=K$3),1,\"\"))","v":""},{"$f":"IF(L$3=\"\",\"\",IF(AND($B115=\"Y\",$C115=\"Y\",$G115=\"Y\",L115=L$3),1,\"\"))","v":""},{"$f":"IF(M$3=\"\",\"\",IF(AND($B115=\"Y\",$C115=\"Y\",$G115=\"Y\",M115=M$3),1,\"\"))","v":""},{"$f":"IF(N$3=\"\",\"\",IF(AND($B115=\"Y\",$C115=\"Y\",$G115=\"Y\",N115=N$3),1,\"\"))","v":""},{"$f":"IF(O$3=\"\",\"\",IF(AND($B115=\"Y\",$C115=\"Y\",$G115=\"Y\",O115=O$3),1,\"\"))","v":""},{"$f":"IF(P$3=\"\",\"\",IF(AND($B115=\"Y\",$C115=\"Y\",$G115=\"Y\",P115=P$3),1,\"\"))","v":""},{"$f":"IF(Q$3=\"\",\"\",IF(AND($B115=\"Y\",$C115=\"Y\",$G115=\"Y\",Q115=Q$3),1,\"\"))","v":""},{"$f":"IF(R$3=\"\",\"\",IF(AND($B115=\"Y\",$C115=\"Y\",$G115=\"Y\",R115=R$3),1,\"\"))","v":""},{"$f":"IF(S$3=\"\",\"\",IF(AND($B115=\"Y\",$C115=\"Y\",$G115=\"Y\",S115=S$3),1,\"\"))","v":""},{"$f":"IF(T$3=\"\",\"\",IF(AND($B115=\"Y\",$C115=\"Y\",$G115=\"Y\",T115=T$3),1,\"\"))","v":""},{"$f":"IF(U$3=\"\",\"\",IF(AND($B115=\"Y\",$C115=\"Y\",$G115=\"Y\",U115=U$3),1,\"\"))","v":""},{"$f":"IF(V$3=\"\",\"\",IF(AND($B115=\"Y\",$C115=\"Y\",$G115=\"Y\",V115=V$3),1,\"\"))","v":""},{"$f":"IF(W$3=\"\",\"\",IF(AND($B115=\"Y\",$C115=\"Y\",$G115=\"Y\",W115=W$3),1,\"\"))","v":""},{"$f":"IF(X$3=\"\",\"\",IF(AND($B115=\"Y\",$C115=\"Y\",$G115=\"Y\",X115=X$3),1,\"\"))","v":""},{"$f":"IF(Y$3=\"\",\"\",IF(AND($B115=\"Y\",$C115=\"Y\",$G115=\"Y\",Y115=Y$3),1,\"\"))","v":""},{"$f":"IF(B115<>\"Y\",\"\",IF(Z115=\"\",\"\",Z115*$E$3))","v":""}]
[null,{"$f":"COUNTIF(B6:B115,\"Y\")","v":0},0,{"$f":"IF(AND(B116=C116,C116=G116),\"OK\", \"ERROR\")","v":"OK"},null,null,{"$f":"COUNTIF(G6:G115,\"Y\")","v":0}]
{"$rows_empty":24}
[{"$nulls":6},"COURSE PARS TABLE"]
[{"$nulls":6},"** DO NOT CHANGE THIS TABLE/AREA UNLESS YOU KNOW EXACTLY WHAT YOU'RE DOING - CALL MIKE PHILLIPS IF NEEDED"]
[{"$nulls":6},"Hole #",1,2,3,4,5,6,7,8,9,10,11,12,13,14,15,16,17,18]
[{"$nulls":5},"2025-03-03","CC",4,4,3,4,4,3,4,5,4,4,3,5,4,4,3,5,4,4,"Coosaw Creek"]
[{"$nulls":5},"2025-02-03","CM",4,5,4,3,4,4,5,3,4,5,3,4,4,3,5,4,4,4,"Chas Muni"]
[{"$nulls":5},"2025-01-27","CN",4,3,4,4,5,4,3,4,5,5,4,5,4,3,4,4,4,3,"Chas National"]
[{"$nulls":5},"2025-04-07","CR",4,5,4,3,4,4,5,3,4,4,5,4,3,4,4,3,4,5,"Crowfield"]
[{"$nulls":5},"2025-11-03","DW",4,4,4,5,4,3,5,3,4,4,5,3,4,4,5,4,3,4,"Dunes West"]
[{"$nulls":5},"2025-05-05","LO",4,4,3,5,4,5,4,3,4,4,3,4,4,4,5,4,3,5,"Legend Oaks"]
[{"$nulls":5},"2025-09-15","PF",4,4,5,4,3,4,4,3,5,4,5,4,3,4,4,5,3,4,"Pine Forest"]
[{"$nulls":5},"2025-12-01","RT",4,3,5,4,4,4,4,3,5,4,5,4,4,3,4,5,3,4,"RiverTowne"]
[{"$nulls":5},"2025-10-06","SM",4,4,3,5,4,5,3,4,3,4,4,4,3,5,4,3,5,4,"Shadowmoss"]
[{"$nulls":5},"2025-06-09","SU",5,3,4,4,4,3,4,4,5,4,5,5,3,4,3,4,3,4,"Summerville"]
[{"$nulls":5},"2025-08-04","WE1",4,5,4,5,4,3,4,3,4,4,4,4,3,5,4,4,3,5,"Wescott (BK-BR)"]
[{"$nulls":5},{"$f":"F154","v":"2025-08-04"},"WE2",4,4,3,5,4,4,5,3,4,4,5,4,5,4,3,4,3,4,"Wescott (OF-BK)"]
[]
[{"$nulls":5},"Stono Ferry","SF",4,3,4,4,5,3,4,5,4,4,3,4,4,3,5,4,5,4,"Stono Ferry"]

{"sheet":"Print","index":1,"n_rows":107,"n_cols":29,"rows_kept":107,"hidden":true,"merged":[[0,0,0,10],[0,12,0,25],[0,28,4,30],[5,28,10,30]]}
["SKINS PAID PLAYERS (AFTER CHECK-IN) - SORTED BY STARTING HOLE #",{"$nulls":11},"SKINS PAID PLAYERS (AFTER CHECK-IN)  -  DEVIATIONS REVEAL CHANGES",{"$nulls":15},"BEFORE CHECK-IN\n- SORT_SKINS (or SORT_SKINS_CR) button before copying data\n- Copy SKINS!C6:F115 to Clipboard\n- Paste Special - Values into green background B3 cell on this TAB"]
["#","Club","Start Tee","Name","Card\nCheck",null,"#","Club","Start Tee","Name","Card \nCheck",null,"#","SKINS","PAID","Club","Start Tee","Name","STATUS","STATUS",null,"#","Club","Start Tee","Name","Card \nCheck","STATUS"]
[1,{"$f":"IF(AND(SKINS!$B6=\"Y\",SKINS!$C6=\"Y\"),SKINS!D6,\"\")","v":""},{"$f":"IF(AND(SKINS!$B6=\"Y\",SKINS!$C6=\"Y\"),SKINS!E6,\"\")","v":""},{"$f":"IF(AND(SKINS!$B6=\"Y\",SKINS!$C6=\"Y\"),SKINS!F6,\"\")","v":""},null,null,{"$f":"A38","v":36},{"$f":"B38","v":""},{"$f":"C38","v":""},{"$f":"D38","v":""},null,null,1,null,null,"CC","#1 - 8:30","Scott Simpson",{"$f":"_xlfn.XLOOKUP(R3,$D$3:$D$72,$D$3:$D$72,\"\")","v":""},{"$f":"IF(R3=\"\",\"-\",IF(S3=\"\",\"OUT\",\"IN\"))","v":"OUT"},null,{"$f":"M73","v":36},{"$f":"IF(P38=\"\",\"\",P38)","v":"CN"},{"$f":"IF(Q38=\"\",\"\",Q38)","v":"#1 - 10:09"},{"$f":"IF(R38=\"\",\"\",R38)","v":"Loren Wolfe"},{"$f":"S38","v":""},{"$f":"IF(Y3=\"\",\"-\",IF(Z3=\"\",\"OUT\",\"IN\"))","v":"OUT"}]
[2,{"$f":"IF(AND(SKINS!$B7=\"Y\",SKINS!$C7=\"Y\"),SKINS!D7,\"\")","v":""},{"$f":"IF(AND(SKINS!$B7=\"Y\",SKINS!$C7=\"Y\"),SKINS!E7,\"\")","v":""},{"$f":"IF(AND(SKINS!$B7=\"Y\",SKINS!$C7=\"Y\"),SKINS!F7,\"\")","v":""},null,null,{"$f":"A39","v":37},{"$f":"B39","v":""},{"$f":"C39","v":""},{"$f":"D39","v":""},null,null,2,null,null,"CN","#1 - 8:30","Paul Chisari",{"$f":"_xlfn.XLOOKUP(R4,$D$3:$D$72,$D$3:$D$72,\"\")","v":""},{"$f":"IF(R4=\"\",\"-\",IF(S4=\"\",\"OUT\",\"IN\"))","v":"OUT"},null,37,"SM","#1 - 10:09","Tim Cobaugh",{"$f":"S39","v":""},{"$f":"IF(Y4=\"\",\"-\",IF(Z4=\"\",\"OUT\",\"IN\"))","v":"OUT"}]
[3,{"$f":"IF(AND(SKINS!$B8=\"Y\",SKINS!$C8=\"Y\"),SKINS!D8,\"\")","v":""},{"$f":"IF(AND(SKINS!$B8=\"Y\",SKINS!$C8=\"Y\"),SKINS!E8,\"\")","v":""},{"$f":"IF(AND(SKINS!$B8=\"Y\",SKINS!$C8=\"Y\"),SKINS!F8,\"\")","v":""},null,null,38,"","","",null,null,3,null,null,"DW","#1 - 8:30","Chris Lee","","OUT",null,38,"SM","#1 - 10:09","Lynn Carroll","","OUT"]
[4,{"$f":"IF(AND(SKINS!$B9=\"Y\",SKINS!$C9=\"Y\"),SKINS!D9,\"\")","v":""},{"$f":"IF(AND(SKINS!$B9=\"Y\",SKINS!$C9=\"Y\"),SKINS!E9,\"\")","v":""},{"$f":"IF(AND(SKINS!$B9=\"Y\",SKINS!$C9=\"Y\"),SKINS!F9,\"\")","v":""},null,null,39,"","","",null,null,4,null,null,"SM","#1 - 8:30","Brian Rawl >F","","OUT",null,39,"SM","#10 - 10:09","Steve Traeger >F","","OUT",null,"AFTER CHECK-IN (BEFORE POSTING SKINS)\n- SORT_SKINS (SORT_SKINS_CR) button before copying data\n- Hit COPY Button (this page) to COPY 'AFTER CHECK-IN' data"]
[5,{"$f":"IF(AND(SKINS!$B10=\"Y\",SKINS!$C10=\"Y\"),SKINS!D10,\"\")","v":""},{"$f":"IF(AND(SKINS!$B10=\"Y\",SKINS!$C10=\"Y\"),SKINS!E10,\"\")","v":""},{"$f":"IF(AND(SKINS!$B10=\"Y\",SKINS!$C10=\"Y\"),SKINS!F10,\"\")","v":""},null,null,40,"","","",null,null,5,null,null,"CN","#1 - 8:39","Burt Bierman","","OUT",null,40,"SM","#10 - 10:09","Leon McDonald >F","","OUT"]
[6,{"$f":"IF(AND(SKINS!$B11=\"Y\",SKINS!$C11=\"Y\"),SKINS!D11,\"\")","v":""},{"$f":"IF(AND(SKINS!$B11=\"Y\",SKINS!$C11=\"Y\"),SKINS!E11,\"\")","v":""},{"$f":"IF(AND(SKINS!$B11=\"Y\",SKINS!$C11=\"Y\"),SKINS!F11,\"\")","v":""},null,null,41,"","","",null,null,6,null,null,"SM","#1 - 8:39","Dave Silveri >F","","OUT",null,41,"WE","#10 - 10:09","Norm Shwarts >F","","OUT"]
[7,{"$f":"IF(AND(SKINS!$B12=\"Y\",SKINS!$C12=\"Y\"),SKINS!D12,\"\")","v":""},{"$f":"IF(AND(SKINS!$B12=\"Y\",SKINS!$C12=\"Y\"),SKINS!E12,\"\")","v":""},{"$f":"IF(AND(SKINS!$B12=\"Y\",SKINS!$C12=\"Y\"),SKINS!F12,\"\")","v":""},null,null,42,"","","",null,null,7,null,null,"CN","#10 - 8:39","Earl Richter","","OUT",null,42,"WE","#10 - 10:09","Mark Murray","","OUT"]
[8,{"$f":"IF(AND(SKINS!$B13=\"Y\",SKINS!$C13=\"Y\"),SKINS!D13,\"\")","v":""},{"$f":"IF(AND(SKINS!$B13=\"Y\",SKINS!$C13=\"Y\"),SKINS!E13,\"\")","v":""},{"$f":"IF(AND(SKINS!$B13=\"Y\",SKINS!$C13=\"Y\"),SKINS!F13,\"\")","v":""},null,null,43,"","","",null,null,8,null,null,"CN","#10 - 8:39","Steve Shoff","","OUT",null,43,"CM","#1 - 10:18","Bernie Rotundo >F","","OUT"]
[9,{"$f":"IF(AND(SKINS!$B14=\"Y\",SKINS!$C14=\"Y\"),SKINS!D14,\"\")","v":""},{"$f":"IF(AND(SKINS!$B14=\"Y\",SKINS!$C14=\"Y\"),SKINS!E14,\"\")","v":""},{"$f":"IF(AND(SKINS!$B14=\"Y\",SKINS!$C14=\"Y\"),SKINS!F14,\"\")","v":""},null,null,44,"","","",null,null,9,null,null,"LO","#1 - 8:48","Ron McNally","","OUT",null,44,"RT","#1 - 10:18","Jim Delaney >F","","OUT"]
[10,{"$f":"IF(AND(SKINS!$B15=\"Y\",SKINS!$C15=\"Y\"),SKINS!D15,\"\")","v":""},{"$f":"IF(AND(SKINS!$B15=\"Y\",SKINS!$C15=\"Y\"),SKINS!E15,\"\")","v":""},{"$f":"IF(AND(SKINS!$B15=\"Y\",SKINS!$C15=\"Y\"),SKINS!F15,\"\")","v":""},null,null,45,"","","",null,null,10,null,null,"LO","#1 - 8:48","Nick Greenberg","","OUT",null,45,"CM","#10 - 10:18","Don Orlando >F","","OUT"]
[11,{"$f":"IF(AND(SKINS!$B16=\"Y\",SKINS!$C16=\"Y\"),SKINS!D16,\"\")","v":""},{"$f":"IF(AND(SKINS!$B16=\"Y\",SKINS!$C16=\"Y\"),SKINS!E16,\"\")","v":""},{"$f":"IF(AND(SKINS!$B16=\"Y\",SKINS!$C16=\"Y\"),SKINS!F16,\"\")","v":""},null,null,46,"","","",null,null,11,null,null,"CN","#10 - 8:48","Willie Charles","","OUT",null,46,"CR","#10 - 10:18","Rick Kemble","","OUT"]
[12,{"$f":"IF(AND(SKINS!$B17=\"Y\",SKINS!$C17=\"Y\"),SKINS!D17,\"\")","v":""},{"$f":"IF(AND(SKINS!$B17=\"Y\",SKINS!$C17=\"Y\"),SKINS!E17,\"\")","v":""},{"$f":"IF(AND(SKINS!$B17=\"Y\",SKINS!$C17=\"Y\"),SKINS!F17,\"\")","v":""},null,null,47,"","","",null,null,12,null,null,"SM","#10 - 8:48","Ron Gosnell >F","","OUT",null,47,"RT","#10 - 10:18","John Hubbard >F","","OUT"]
[13,{"$f":"IF(AND(SKINS!$B18=\"Y\",SKINS!$C18=\"Y\"),SKINS!D18,\"\")","v":""},{"$f":"IF(AND(SKINS!$B18=\"Y\",SKINS!$C18=\"Y\"),SKINS!E18,\"\")","v":""},{"$f":"IF(AND(SKINS!$B18=\"Y\",SKINS!$C18=\"Y\"),SKINS!F18,\"\")","v":""},null,null,48,"","","",null,null,13,null,null,"CC","#1 - 8:57","Pete Thompson","","OUT",null,48,"SU","#10 - 10:18","John Rohr >F","","OUT"]
[14,{"$f":"IF(AND(SKINS!$B19=\"Y\",SKINS!$C19=\"Y\"),SKINS!D19,\"\")","v":""},{"$f":"IF(AND(SKINS!$B19=\"Y\",SKINS!$C19=\"Y\"),SKINS!E19,\"\")","v":""},{"$f":"IF(AND(SKINS!$B19=\"Y\",SKINS!$C19=\"Y\"),SKINS!F19,\"\")","v":""},null,null,49,"","","",null,null,14,null,null,"CN","#1 - 8:57","Sonny McKay","","OUT",null,49,"SU","#1 - 10:27","Gary Hartmann","","OUT"]
[15,{"$f":"IF(AND(SKINS!$B20=\"Y\",SKINS!$C20=\"Y\"),SKINS!D20,\"\")","v":""},{"$f":"IF(AND(SKINS!$B20=\"Y\",SKINS!$C20=\"Y\"),SKINS!E20,\"\")","v":""},{"$f":"IF(AND(SKINS!$B20=\"Y\",SKINS!$C20=\"Y\"),SKINS!F20,\"\")","v":""},null,null,50,"","","",null,null,15,null,null,"SU","#1 - 8:57","Allan Sharkey >F","","OUT",null,50,"SU","#1 - 10:27","Gerry Purvis","","OUT"]
[16,{"$f":"IF(AND(SKINS!$B21=\"Y\",SKINS!$C21=\"Y\"),SKINS!D21,\"\")","v":""},{"$f":"IF(AND(SKINS!$B21=\"Y\",SKINS!$C21=\"Y\"),SKINS!E21,\"\")","v":""},{"$f":"IF(AND(SKINS!$B21=\"Y\",SKINS!$C21=\"Y\"),SKINS!F21,\"\")","v":""},null,null,51,"","","",null,null,16,null,null,"WE","#1 - 8:57","Bernie Calcagni >F","","OUT",null,51,"LO","#10 - 10:27","Mike Phillips","","OUT"]
[17,{"$f":"IF(AND(SKINS!$B22=\"Y\",SKINS!$C22=\"Y\"),SKINS!D22,\"\")","v":""},{"$f":"IF(AND(SKINS!$B22=\"Y\",SKINS!$C22=\"Y\"),SKINS!E22,\"\")","v":""},{"$f":"IF(AND(SKINS!$B22=\"Y\",SKINS!$C22=\"Y\"),SKINS!F22,\"\")","v":""},null,null,52,"","","",null,null,17,null,null,"SU","#10 - 9:06","Phil Richardson >F","","OUT",null,52,"PF","#10 - 10:27","Joe DeFilippo","","OUT"]
[18,{"$f":"IF(AND(SKINS!$B23=\"Y\",SKINS!$C23=\"Y\"),SKINS!D23,\"\")","v":""},{"$f":"IF(AND(SKINS!$B23=\"Y\",SKINS!$C23=\"Y\"),SKINS!E23,\"\")","v":""},{"$f":"IF(AND(SKINS!$B23=\"Y\",SKINS!$C23=\"Y\"),SKINS!F23,\"\")","v":""},null,null,53,"","","",null,null,18,null,null,"SU","#10 - 9:06","Art Rooney >F","","OUT",null,53,"","","","","-"]
[19,{"$f":"IF(AND(SKINS!$B24=\"Y\",SKINS!$C24=\"Y\"),SKINS!D24,\"\")","v":""},{"$f":"IF(AND(SKINS!$B24=\"Y\",SKINS!$C24=\"Y\"),SKINS!E24,\"\")","v":""},{"$f":"IF(AND(SKINS!$B24=\"Y\",SKINS!$C24=\"Y\"),SKINS!F24,\"\")","v":""},null,null,54,"","","",null,null,19,null,null,"CM","#1 - 9:15","Eddy Stubbs","","OUT",null,54,"","","","","-"]
[20,{"$f":"IF(AND(SKINS!$B25=\"Y\",SKINS!$C25=\"Y\"),SKINS!D25,\"\")","v":""},{"$f":"IF(AND(SKINS!$B25=\"Y\",SKINS!$C25=\"Y\"),SKINS!E25,\"\")","v":""},{"$f":"IF(AND(SKINS!$B25=\"Y\",SKINS!$C25=\"Y\"),SKINS!F25,\"\")","v":""},null,null,55,"","","",null,null,20,null,null,"CM","#10 - 9:15","Bubba Livingston","","OUT",null,55,"","","","","-"]
[21,{"$f":"IF(AND(SKINS!$B26=\"Y\",SKINS!$C26=\"Y\"),SKINS!D26,\"\")","v":""},{"$f":"IF(AND(SKINS!$B26=\"Y\",SKINS!$C26=\"Y\"),SKINS!E26,\"\")","v":""},{"$f":"IF(AND(SKINS!$B26=\"Y\",SKINS!$C26=\"Y\"),SKINS!F26,\"\")","v":""},null,null,56,"","","",null,null,21,null,null,"SM","#1 - 9:24","Don Burckhardt","","OUT",null,56,"","","","","-"]
[22,{"$f":"IF(AND(SKINS!$B27=\"Y\",SKINS!$C27=\"Y\"),SKINS!D27,\"\")","v":""},{"$f":"IF(AND(SKINS!$B27=\"Y\",SKINS!$C27=\"Y\"),SKINS!E27,\"\")","v":""},{"$f":"IF(AND(SKINS!$B27=\"Y\",SKINS!$C27=\"Y\"),SKINS!F27,\"\")","v":""},null,null,57,"","","",null,null,22,null,null,"SM","#1 - 9:24","Bob Cultra","","OUT",null,57,"","","","","-"]
[23,{"$f":"IF(AND(SKINS!$B28=\"Y\",SKINS!$C28=\"Y\"),SKINS!D28,\"\")","v":""},{"$f":"IF(AND(SKINS!$B28=\"Y\",SKINS!$C28=\"Y\"),SKINS!E28,\"\")","v":""},{"$f":"IF(AND(SKINS!$B28=\"Y\",SKINS!$C28=\"Y\"),SKINS!F28,\"\")","v":""},null,null,58,"","","",null,null,23,null,null,"WE","#1 - 9:42","Stan Petrohovich","","OUT",null,58,"","","","","-"]
[24,{"$f":"IF(AND(SKINS!$B29=\"Y\",SKINS!$C29=\"Y\"),SKINS!D29,\"\")","v":""},{"$f":"IF(AND(SKINS!$B29=\"Y\",SKINS!$C29=\"Y\"),SKINS!E29,\"\")","v":""},{"$f":"IF(AND(SKINS!$B29=\"Y\",SKINS!$C29=\"Y\"),SKINS!F29,\"\")","v":""},null,null,59,"","","",null,null,24,null,null,"WE","#1 - 9:42","Travis Wiley","","OUT",null,59,"","","","","-"]
[25,{"$f":"IF(AND(SKINS!$B30=\"Y\",SKINS!$C30=\"Y\"),SKINS!D30,\"\")","v":""},{"$f":"IF(AND(SKINS!$B30=\"Y\",SKINS!$C30=\"Y\"),SKINS!E30,\"\")","v":""},{"$f":"IF(AND(SKINS!$B30=\"Y\",SKINS!$C30=\"Y\"),SKINS!F30,\"\")","v":""},null,null,60,"","","",null,null,25,null,null,"PF","#1 - 9:51","Chris Lloyd","","OUT",null,60,"","","","","-"]
[26,{"$f":"IF(AND(SKINS!$B31=\"Y\",SKINS!$C31=\"Y\"),SKINS!D31,\"\")","v":""},{"$f":"IF(AND(SKINS!$B31=\"Y\",SKINS!$C31=\"Y\"),SKINS!E31,\"\")","v":""},{"$f":"IF(AND(SKINS!$B31=\"Y\",SKINS!$C31=\"Y\"),SKINS!F31,\"\")","v":""},null,null,61,"","","",null,null,26,null,null,"WE","#1 - 9:51","Doug Brainerd","","OUT",null,61,"","","","","-"]
[27,{"$f":"IF(AND(SKINS!$B32=\"Y\",SKINS!$C32=\"Y\"),SKINS!D32,\"\")","v":""},{"$f":"IF(AND(SKINS!$B32=\"Y\",SKINS!$C32=\"Y\"),SKINS!E32,\"\")","v":""},{"$f":"IF(AND(SKINS!$B32=\"Y\",SKINS!$C32=\"Y\"),SKINS!F32,\"\")","v":""},null,null,62,"","","",null,null,27,null,null,"LO","#10 - 9:51","C.H. Coleman","","OUT",null,62,"","","","","-"]
[28,{"$f":"IF(AND(SKINS!$B33=\"Y\",SKINS!$C33=\"Y\"),SKINS!D33,\"\")","v":""},{"$f":"IF(AND(SKINS!$B33=\"Y\",SKINS!$C33=\"Y\"),SKINS!E33,\"\")","v":""},{"$f":"IF(AND(SKINS!$B33=\"Y\",SKINS!$C33=\"Y\"),SKINS!F33,\"\")","v":""},null,null,63,"","","",null,null,28,null,null,"LO","#10 - 9:51","Ken Sharp >F","","OUT",null,63,"","","","","-"]
[29,{"$f":"IF(AND(SKINS!$B34=\"Y\",SKINS!$C34=\"Y\"),SKINS!D34,\"\")","v":""},{"$f":"IF(AND(SKINS!$B34=\"Y\",SKINS!$C34=\"Y\"),SKINS!E34,\"\")","v":""},{"$f":"IF(AND(SKINS!$B34=\"Y\",SKINS!$C34=\"Y\"),SKINS!F34,\"\")","v":""},null,null,64,"","","",null,null,29,null,null,"CN","#1 - 10:00","Fred Moscowich","","OUT",null,64,"","","","","-"]
[30,{"$f":"IF(AND(SKINS!$B35=\"Y\",SKINS!$C35=\"Y\"),SKINS!D35,\"\")","v":""},{"$f":"IF(AND(SKINS!$B35=\"Y\",SKINS!$C35=\"Y\"),SKINS!E35,\"\")","v":""},{"$f":"IF(AND(SKINS!$B35=\"Y\",SKINS!$C35=\"Y\"),SKINS!F35,\"\")","v":""},null,null,65,"","","",null,null,30,null,null,"CN","#1 - 10:00","Jim Zadora","","OUT",null,65,"","","","","-"]
[31,{"$f":"IF(AND(SKINS!$B36=\"Y\",SKINS!$C36=\"Y\"),SKINS!D36,\"\")","v":""},{"$f":"IF(AND(SKINS!$B36=\"Y\",SKINS!$C36=\"Y\"),SKINS!E36,\"\")","v":""},{"$f":"IF(AND(SKINS!$B36=\"Y\",SKINS!$C36=\"Y\"),SKINS!F36,\"\")","v":""},null,null,66,"","","",null,null,31,null,null,"CR","#1 - 10:00","George Dowd >F","","OUT",null,66,"","","","","-"]
[32,{"$f":"IF(AND(SKINS!$B37=\"Y\",SKINS!$C37=\"Y\"),SKINS!D37,\"\")","v":""},{"$f":"IF(AND(SKINS!$B37=\"Y\",SKINS!$C37=\"Y\"),SKINS!E37,\"\")","v":""},{"$f":"IF(AND(SKINS!$B37=\"Y\",SKINS!$C37=\"Y\"),SKINS!F37,\"\")","v":""},null,null,67,"","","",null,null,32,null,null,"LO","#1 - 10:00","Brian Kelley","","OUT",null,67,"","","","","-"]
[33,{"$f":"IF(AND(SKINS!$B38=\"Y\",SKINS!$C38=\"Y\"),SKINS!D38,\"\")","v":""},{"$f":"IF(AND(SKINS!$B38=\"Y\",SKINS!$C38=\"Y\"),SKINS!E38,\"\")","v":""},{"$f":"IF(AND(SKINS!$B38=\"Y\",SKINS!$C38=\"Y\"),SKINS!F38,\"\")","v":""},null,null,68,"","","",null,null,33,null,null,"CM","#10 - 10:00","Bob Nitkewicz >F","","OUT",null,68,"","","","","-"]
[34,{"$f":"IF(AND(SKINS!$B39=\"Y\",SKINS!$C39=\"Y\"),SKINS!D39,\"\")","v":""},{"$f":"IF(AND(SKINS!$B39=\"Y\",SKINS!$C39=\"Y\"),SKINS!E39,\"\")","v":""},{"$f":"IF(AND(SKINS!$B39=\"Y\",SKINS!$C39=\"Y\"),SKINS!F39,\"\")","v":""},null,null,69,"","","",null,null,34,null,null,"WE","#10 - 10:00","Kelly Spence","","OUT",null,69,"","","","","-"]
[35,{"$f":"IF(AND(SKINS!$B40=\"Y\",SKINS!$C40=\"Y\"),SKINS!D40,\"\")","v":""},{"$f":"IF(AND(SKINS!$B40=\"Y\",SKINS!$C40=\"Y\"),SKINS!E40,\"\")","v":""},{"$f":"IF(AND(SKINS!$B40=\"Y\",SKINS!$C40=\"Y\"),SKINS!F40,\"\")","v":""},null,null,70,"","","",null,null,35,null,null,"CN","#1 - 10:09","Peter Kelleher","","OUT",null,70,"","","","","-"]
[36,{"$f":"IF(AND(SKINS!$B41=\"Y\",SKINS!$C41=\"Y\"),SKINS!D41,\"\")","v":""},{"$f":"IF(AND(SKINS!$B41=\"Y\",SKINS!$C41=\"Y\"),SKINS!E41,\"\")","v":""},{"$f":"IF(AND(SKINS!$B41=\"Y\",SKINS!$C41=\"Y\"),SKINS!F41,\"\")","v":""},{"$nulls":8},36,null,null,"CN","#1 - 10:09","Loren Wolfe","","OUT"]
[37,{"$f":"IF(AND(SKINS!$B42=\"Y\",SKINS!$C42=\"Y\"),SKINS!D42,\"\")","v":""},{"$f":"IF(AND(SKINS!$B42=\"Y\",SKINS!$C42=\"Y\"),SKINS!E42,\"\")","v":""},{"$f":"IF(AND(SKINS!$B42=\"Y\",SKINS!$C42=\"Y\"),SKINS!F42,\"\")","v":""},{"$nulls":8},37,null,null,"SM","#1 - 10:09","Tim Cobaugh","","OUT"]
[38,{"$f":"IF(AND(SKINS!$B43=\"Y\",SKINS!$C43=\"Y\"),SKINS!D43,\"\")","v":""},{"$f":"IF(AND(SKINS!$B43=\"Y\",SKINS!$C43=\"Y\"),SKINS!E43,\"\")","v":""},{"$f":"IF(AND(SKINS!$B43=\"Y\",SKINS!$C43=\"Y\"),SKINS!F43,\"\")","v":""},{"$nulls":8},38,null,null,"SM","#1 - 10:09","Lynn Carroll","","OUT"]
[39,{"$f":"IF(AND(SKINS!$B44=\"Y\",SKINS!$C44=\"Y\"),SKINS!D44,\"\")","v":""},{"$f":"IF(AND(SKINS!$B44=\"Y\",SKINS!$C44=\"Y\"),SKINS!E44,\"\")","v":""},{"$f":"IF(AND(SKINS!$B44=\"Y\",SKINS!$C44=\"Y\"),SKINS!F44,\"\")","v":""},{"$nulls":8},39,null,null,"SM","#10 - 10:09","Steve Traeger >F","","OUT"]
[40,{"$f":"IF(AND(SKINS!$B45=\"Y\",SKINS!$C45=\"Y\"),SKINS!D45,\"\")","v":""},{"$f":"IF(AND(SKINS!$B45=\"Y\",SKINS!$C45=\"Y\"),SKINS!E45,\"\")","v":""},{"$f":"IF(AND(SKINS!$B45=\"Y\",SKINS!$C45=\"Y\"),SKINS!F45,\"\")","v":""},{"$nulls":8},40,null,null,"SM","#10 - 10:09","Leon McDonald >F","","OUT"]
[41,{"$f":"IF(AND(SKINS!$B46=\"Y\",SKINS!$C46=\"Y\"),SKINS!D46,\"\")","v":""},{"$f":"IF(AND(SKINS!$B46=\"Y\",SKINS!$C46=\"Y\"),SKINS!E46,\"\")","v":""},{"$f":"IF(AND(SKINS!$B46=\"Y\",SKINS!$C46=\"Y\"),SKINS!F46,\"\")","v":""},{"$nulls":8},41,null,null,"WE","#10 - 10:09","Norm Shwarts >F","","OUT"]
[42,{"$f":"IF(AND(SKINS!$B47=\"Y\",SKINS!$C47=\"Y\"),SKINS!D47,\"\")","v":""},{"$f":"IF(AND(SKINS!$B47=\"Y\",SKINS!$C47=\"Y\"),SKINS!E47,\"\")","v":""},{"$f":"IF(AND(SKINS!$B47=\"Y\",SKINS!$C47=\"Y\"),SKINS!F47,\"\")","v":""},{"$nulls":8},42,null,null,"WE","#10 - 10:09","Mark Murray","","OUT"]
[43,{"$f":"IF(AND(SKINS!$B48=\"Y\",SKINS!$C48=\"Y\"),SKINS!D48,\"\")","v":""},{"$f":"IF(AND(SKINS!$B48=\"Y\",SKINS!$C48=\"Y\"),SKINS!E48,\"\")","v":""},{"$f":"IF(AND(SKINS!$B48=\"Y\",SKINS!$C48=\"Y\"),SKINS!F48,\"\")","v":""},{"$nulls":8},43,null,null,"CM","#1 - 10:18","Bernie Rotundo >F","","OUT"]
[44,{"$f":"IF(AND(SKINS!$B49=\"Y\",SKINS!$C49=\"Y\"),SKINS!D49,\"\")","v":""},{"$f":"IF(AND(SKINS!$B49=\"Y\",SKINS!$C49=\"Y\"),SKINS!E49,\"\")","v":""},{"$f":"IF(AND(SKINS!$B49=\"Y\",SKINS!$C49=\"Y\"),SKINS!F49,\"\")","v":""},{"$nulls":8},44,null,null,"RT","#1 - 10:18","Jim Delaney >F","","OUT"]
[45,{"$f":"IF(AND(SKINS!$B50=\"Y\",SKINS!$C50=\"Y\"),SKINS!D50,\"\")","v":""},{"$f":"IF(AND(SKINS!$B50=\"Y\",SKINS!$C50=\"Y\"),SKINS!E50,\"\")","v":""},{"$f":"IF(AND(SKINS!$B50=\"Y\",SKINS!$C50=\"Y\"),SKINS!F50,\"\")","v":""},{"$nulls":8},45,null,null,"CM","#10 - 10:18","Don Orlando >F","","OUT"]
[46,{"$f":"IF(AND(SKINS!$B51=\"Y\",SKINS!$C51=\"Y\"),SKINS!D51,\"\")","v":""},{"$f":"IF(AND(SKINS!$B51=\"Y\",SKINS!$C51=\"Y\"),SKINS!E51,\"\")","v":""},{"$f":"IF(AND(SKINS!$B51=\"Y\",SKINS!$C51=\"Y\"),SKINS!F51,\"\")","v":""},{"$nulls":8},46,null,null,"CR","#10 - 10:18","Rick Kemble","","OUT"]
[47,{"$f":"IF(AND(SKINS!$B52=\"Y\",SKINS!$C52=\"Y\"),SKINS!D52,\"\")","v":""},{"$f":"IF(AND(SKINS!$B52=\"Y\",SKINS!$C52=\"Y\"),SKINS!E52,\"\")","v":""},{"$f":"IF(AND(SKINS!$B52=\"Y\",SKINS!$C52=\"Y\"),SKINS!F52,\"\")","v":""},{"$nulls":8},47,null,null,"RT","#10 - 10:18","John Hubbard >F","","OUT"]
[48,{"$f":"IF(AND(SKINS!$B53=\"Y\",SKINS!$C53=\"Y\"),SKINS!D53,\"\")","v":""},{"$f":"IF(AND(SKINS!$B53=\"Y\",SKINS!$C53=\"Y\"),SKINS!E53,\"\")","v":""},{"$f":"IF(AND(SKINS!$B53=\"Y\",SKINS!$C53=\"Y\"),SKINS!F53,\"\")","v":""},{"$nulls":8},48,null,null,"SU","#10 - 10:18","John Rohr >F","","OUT"]
[49,{"$f":"IF(AND(SKINS!$B54=\"Y\",SKINS!$C54=\"Y\"),SKINS!D54,\"\")","v":""},{"$f":"IF(AND(SKINS!$B54=\"Y\",SKINS!$C54=\"Y\"),SKINS!E54,\"\")","v":""},{"$f":"IF(AND(SKINS!$B54=\"Y\",SKINS!$C54=\"Y\"),SKINS!F54,\"\")","v":""},{"$nulls":8},49,null,null,"SU","#1 - 10:27","Gary Hartmann","","OUT"]
[50,{"$f":"IF(AND(SKINS!$B55=\"Y\",SKINS!$C55=\"Y\"),SKINS!D55,\"\")","v":""},{"$f":"IF(AND(SKINS!$B55=\"Y\",SKINS!$C55=\"Y\"),SKINS!E55,\"\")","v":""},{"$f":"IF(AND(SKINS!$B55=\"Y\",SKINS!$C55=\"Y\"),SKINS!F55,\"\")","v":""},{"$nulls":8},50,null,null,"SU","#1 - 10:27","Gerry Purvis","","OUT"]
[51,{"$f":"IF(AND(SKINS!$B56=\"Y\",SKINS!$C56=\"Y\"),SKINS!D56,\"\")","v":""},{"$f":"IF(AND(SKINS!$B56=\"Y\",SKINS!$C56=\"Y\"),SKINS!E56,\"\")","v":""},{"$f":"IF(AND(SKINS!$B56=\"Y\",SKINS!$C56=\"Y\"),SKINS!F56,\"\")","v":""},{"$nulls":8},51,null,null,"LO","#10 - 10:27","Mike Phillips","","OUT"]
[52,{"$f":"IF(AND(SKINS!$B57=\"Y\",SKINS!$C57=\"Y\"),SKINS!D57,\"\")","v":""},{"$f":"IF(AND(SKINS!$B57=\"Y\",SKINS!$C57=\"Y\"),SKINS!E57,\"\")","v":""},{"$f":"IF(AND(SKINS!$B57=\"Y\",SKINS!$C57=\"Y\"),SKINS!F57,\"\")","v":""},{"$nulls":8},52,null,null,"PF","#10 - 10:27","Joe DeFilippo","","OUT"]
[53,{"$f":"IF(AND(SKINS!$B58=\"Y\",SKINS!$C58=\"Y\"),SKINS!D58,\"\")","v":""},{"$f":"IF(AND(SKINS!$B58=\"Y\",SKINS!$C58=\"Y\"),SKINS!E58,\"\")","v":""},{"$f":"IF(AND(SKINS!$B58=\"Y\",SKINS!$C58=\"Y\"),SKINS!F58,\"\")","v":""},{"$nulls":8},53,null,null,"","","","","-"]
[54,{"$f":"IF(AND(SKINS!$B59=\"Y\",SKINS!$C59=\"Y\"),SKINS!D59,\"\")","v":""},{"$f":"IF(AND(SKINS!$B59=\"Y\",SKINS!$C59=\"Y\"),SKINS!E59,\"\")","v":""},{"$f":"IF(AND(SKINS!$B59=\"Y\",SKINS!$C59=\"Y\"),SKINS!F59,\"\")","v":""},{"$nulls":8},54,null,null,"","","","","-"]
[55,{"$f":"IF(AND(SKINS!$B60=\"Y\",SKINS!$C60=\"Y\"),SKINS!D60,\"\")","v":""},{"$f":"IF(AND(SKINS!$B60=\"Y\",SKINS!$C60=\"Y\"),SKINS!E60,\"\")","v":""},{"$f":"IF(AND(SKINS!$B60=\"Y\",SKINS!$C60=\"Y\"),SKINS!F60,\"\")","v":""},{"$nulls":8},55,null,null,"","","","","-"]
[56,{"$f":"IF(AND(SKINS!$B61=\"Y\",SKINS!$C61=\"Y\"),SKINS!D61,\"\")","v":""},{"$f":"IF(AND(SKINS!$B61=\"Y\",SKINS!$C61=\"Y\"),SKINS!E61,\"\")","v":""},{"$f":"IF(AND(SKINS!$B61=\"Y\",SKINS!$C61=\"Y\"),SKINS!F61,\"\")","v":""},{"$nulls":8},56,null,null,"","","","","-"]
[57,{"$f":"IF(AND(SKINS!$B62=\"Y\",SKINS!$C62=\"Y\"),SKINS!D62,\"\")","v":""},{"$f":"IF(AND(SKINS!$B62=\"Y\",SKINS!$C62=\"Y\"),SKINS!E62,\"\")","v":""},{"$f":"IF(AND(SKINS!$B62=\"Y\",SKINS!$C62=\"Y\"),SKINS!F62,\"\")","v":""},{"$nulls":8},57,null,null,"","","","","-"]
[58,{"$f":"IF(AND(SKINS!$B63=\"Y\",SKINS!$C63=\"Y\"),SKINS!D63,\"\")","v":""},{"$f":"IF(AND(SKINS!$B63=\"Y\",SKINS!$C63=\"Y\"),SKINS!E63,\"\")","v":""},{"$f":"IF(AND(SKINS!$B63=\"Y\",SKINS!$C63=\"Y\"),SKINS!F63,\"\")","v":""},{"$nulls":8},58,null,null,"","","","","-"]
[59,{"$f":"IF(AND(SKINS!$B64=\"Y\",SKINS!$C64=\"Y\"),SKINS!D64,\"\")","v":""},{"$f":"IF(AND(SKINS!$B64=\"Y\",SKINS!$C64=\"Y\"),SKINS!E64,\"\")","v":""},{"$f":"IF(AND(SKINS!$B64=\"Y\",SKINS!$C64=\"Y\"),SKINS!F64,\"\")","v":""},{"$nulls":8},59,null,null,"","","","","-"]
[60,{"$f":"IF(AND(SKINS!$B65=\"Y\",SKINS!$C65=\"Y\"),SKINS!D65,\"\")","v":""},{"$f":"IF(AND(SKINS!$B65=\"Y\",SKINS!$C65=\"Y\"),SKINS!E65,\"\")","v":""},{"$f":"IF(AND(SKINS!$B65=\"Y\",SKINS!$C65=\"Y\"),SKINS!F65,\"\")","v":""},{"$nulls":8},60,null,null,"","","","","-"]
[61,{"$f":"IF(AND(SKINS!$B66=\"Y\",SKINS!$C66=\"Y\"),SKINS!D66,\"\")","v":""},{"$f":"IF(AND(SKINS!$B66=\"Y\",SKINS!$C66=\"Y\"),SKINS!E66,\"\")","v":""},{"$f":"IF(AND(SKINS!$B66=\"Y\",SKINS!$C66=\"Y\"),SKINS!F66,\"\")","v":""},{"$nulls":8},61,null,null,"","","","","-"]
[62,{"$f":"IF(AND(SKINS!$B67=\"Y\",SKINS!$C67=\"Y\"),SKINS!D67,\"\")","v":""},{"$f":"IF(AND(SKINS!$B67=\"Y\",SKINS!$C67=\"Y\"),SKINS!E67,\"\")","v":""},{"$f":"IF(AND(SKINS!$B67=\"Y\",SKINS!$C67=\"Y\"),SKINS!F67,\"\")","v":""},{"$nulls":8},62,null,null,"","","","","-"]
[63,{"$f":"IF(AND(SKINS!$B68=\"Y\",SKINS!$C68=\"Y\"),SKINS!D68,\"\")","v":""},{"$f":"IF(AND(SKINS!$B68=\"Y\",SKINS!$C68=\"Y\"),SKINS!E68,\"\")","v":""},{"$f":"IF(AND(SKINS!$B68=\"Y\",SKINS!$C68=\"Y\"),SKINS!F68,\"\")","v":""},{"$nulls":8},63,null,null,"","","","","-"]
[64,{"$f":"IF(AND(SKINS!$B69=\"Y\",SKINS!$C69=\"Y\"),SKINS!D69,\"\")","v":""},{"$f":"IF(AND(SKINS!$B69=\"Y\",SKINS!$C69=\"Y\"),SKINS!E69,\"\")","v":""},{"$f":"IF(AND(SKINS!$B69=\"Y\",SKINS!$C69=\"Y\"),SKINS!F69,\"\")","v":""},{"$nulls":8},64,null,null,"","","","","-"]
[65,{"$f":"IF(AND(SKINS!$B70=\"Y\",SKINS!$C70=\"Y\"),SKINS!D70,\"\")","v":""},{"$f":"IF(AND(SKINS!$B70=\"Y\",SKINS!$C70=\"Y\"),SKINS!E70,\"\")","v":""},{"$f":"IF(AND(SKINS!$B70=\"Y\",SKINS!$C70=\"Y\"),SKINS!F70,\"\")","v":""},{"$nulls":8},65,null,null,"","","","","-"]
[66,{"$f":"IF(AND(SKINS!$B71=\"Y\",SKINS!$C71=\"Y\"),SKINS!D71,\"\")","v":""},{"$f":"IF(AND(SKINS!$B71=\"Y\",SKINS!$C71=\"Y\"),SKINS!E71,\"\")","v":""},{"$f":"IF(AND(SKINS!$B71=\"Y\",SKINS!$C71=\"Y\"),SKINS!F71,\"\")","v":""},{"$nulls":8},66,null,null,"","","",{"$f":"_xlfn.XLOOKUP(R68,$D$3:$D$72,$D$3:$D$72,\"\")","v":""},{"$f":"IF(R68=\"\",\"-\",IF(S68=\"\",\"OUT\",\"IN\"))","v":"-"}]
[67,{"$f":"IF(AND(SKINS!$B72=\"Y\",SKINS!$C72=\"Y\"),SKINS!D72,\"\")","v":""},{"$f":"IF(AND(SKINS!$B72=\"Y\",SKINS!$C72=\"Y\"),SKINS!E72,\"\")","v":""},{"$f":"IF(AND(SKINS!$B72=\"Y\",SKINS!$C72=\"Y\"),SKINS!F72,\"\")","v":""},{"$nulls":8},67,null,null,"","","","","-"]
[68,{"$f":"IF(AND(SKINS!$B73=\"Y\",SKINS!$C73=\"Y\"),SKINS!D73,\"\")","v":""},{"$f":"IF(AND(SKINS!$B73=\"Y\",SKINS!$C73=\"Y\"),SKINS!E73,\"\")","v":""},{"$f":"IF(AND(SKINS!$B73=\"Y\",SKINS!$C73=\"Y\"),SKINS!F73,\"\")","v":""},{"$nulls":8},68,null,null,"","","","","-"]
[69,{"$f":"IF(AND(SKINS!$B74=\"Y\",SKINS!$C74=\"Y\"),SKINS!D74,\"\")","v":""},{"$f":"IF(AND(SKINS!$B74=\"Y\",SKINS!$C74=\"Y\"),SKINS!E74,\"\")","v":""},{"$f":"IF(AND(SKINS!$B74=\"Y\",SKINS!$C74=\"Y\"),SKINS!F74,\"\")","v":""},{"$nulls":8},69,null,null,"","","","","-"]
[70,{"$f":"IF(AND(SKINS!$B75=\"Y\",SKINS!$C75=\"Y\"),SKINS!D75,\"\")","v":""},{"$f":"IF(AND(SKINS!$B75=\"Y\",SKINS!$C75=\"Y\"),SKINS!E75,\"\")","v":""},{"$f":"IF(AND(SKINS!$B75=\"Y\",SKINS!$C75=\"Y\"),SKINS!F75,\"\")","v":""},{"$nulls":8},70,null,null,"","","","","-"]
[{"$f":"IF(AND(SKINS!$B76=\"Y\",SKINS!$C76=\"Y\"),1+A72,\"\")","v":""},{"$f":"IF(AND(SKINS!$B76=\"Y\",SKINS!$C76=\"Y\"),SKINS!D76,\"\")","v":""},{"$f":"IF(AND(SKINS!$B76=\"Y\",SKINS!$C76=\"Y\"),SKINS!E76,\"\")","v":""},{"$f":"IF(AND(SKINS!$B76=\"Y\",SKINS!$C76=\"Y\"),SKINS!F76,\"\")","v":""},{"$nulls":8},36,null,null,"","","","","-"]
[{"$f":"IF(AND(SKINS!$B77=\"Y\",SKINS!$C77=\"Y\"),1+A73,\"\")","v":""},{"$f":"IF(AND(SKINS!$B77=\"Y\",SKINS!$C77=\"Y\"),SKINS!D77,\"\")","v":""},{"$f":"IF(AND(SKINS!$B77=\"Y\",SKINS!$C77=\"Y\"),SKINS!E77,\"\")","v":""},{"$f":"IF(AND(SKINS!$B77=\"Y\",SKINS!$C77=\"Y\"),SKINS!F77,\"\")","v":""},{"$nulls":8},37,null,null,"","",""]
[{"$f":"IF(AND(SKINS!$B78=\"Y\",SKINS!$C78=\"Y\"),1+A74,\"\")","v":""},{"$f":"IF(AND(SKINS!$B78=\"Y\",SKINS!$C78=\"Y\"),SKINS!D78,\"\")","v":""},{"$f":"IF(AND(SKINS!$B78=\"Y\",SKINS!$C78=\"Y\"),SKINS!E78,\"\")","v":""},{"$f":"IF(AND(SKINS!$B78=\"Y\",SKINS!$C78=\"Y\"),SKINS!F78,\"\")","v":""},{"$nulls":8},38]
[{"$f":"IF(AND(SKINS!$B79=\"Y\",SKINS!$C79=\"Y\"),1+A75,\"\")","v":""},{"$f":"IF(AND(SKINS!$B79=\"Y\",SKINS!$C79=\"Y\"),SKINS!D79,\"\")","v":""},{"$f":"IF(AND(SKINS!$B79=\"Y\",SKINS!$C79=\"Y\"),SKINS!E79,\"\")","v":""},{"$f":"IF(AND(SKINS!$B79=\"Y\",SKINS!$C79=\"Y\"),SKINS!F79,\"\")","v":""},{"$nulls":8},39]
[{"$nulls":12},40]
[{"$nulls":12},41]
[{"$nulls":12},42]
[{"$nulls":12},43]
[{"$nulls":12},44]
[{"$nulls":12},45]
[{"$nulls":12},46]
[{"$nulls":12},47]
[{"$nulls":12},48]
[{"$nulls":12},49]
[{"$nulls":12},50]
[{"$nulls":12},51]
[{"$nulls":12},52]
[{"$nulls":12},53]
[{"$nulls":12},54]
[{"$nulls":12},55]
[{"$nulls":12},56]
[{"$nulls":12},57]
[{"$nulls":12},58]
[{"$nulls":12},59]
[{"$nulls":12},60]
[{"$nulls":12},61]
[{"$nulls":12},62]
[{"$nulls":12},63]
[{"$nulls":12},64]
[{"$nulls":12},65]
[{"$nulls":12},66]
[{"$nulls":12},67]
[{"$nulls":12},68]
[{"$nulls":12},69]
[{"$nulls":12},70]

{"sheet":"SAMPLE SHOTGUN","index":2,"n_rows":115,"n_cols":24,"rows_kept":115,"merged":[[0,0,0,4],[0,5,2,11],[1,0,1,4],[2,0,2,4],[3,0,3,4]]}
["This is the structure and type data you'll get from Google Sheets File.   USE this data to practice Skins tab work for Shotgun Start match.",{"$nulls":4},"USE THIS DATA IF YOU CLEAR ALL ON THE EXAMPLE TAB AS YOU CANNOT UNDO A MACRO THAT CLEARS DATA."]
["Cut and Paste \"All\" Values to the Skins worksheet/tab"]
["COPY/PASTE AREA W/Light Orange Background (no scores)"]
["ALWAYS PASTE \"VALUES\" ONLY"]
["Skins?","Paid?","Club","Start Tee","Name"]
["Y","Y","WE","1A","Stan Petrohovich","Y"]
["Y","Y","WE","1A","Travis Wiley **","Y",null,4,{"$nulls":3},3,{"$nulls":10},3]
["Y","Y","CN","1B","Fred Moscowich **","Y"]
["Y","Y","CN","1B","Jim Zadora","Y"]
["Y","Y","RT","2A","Jim Delaney >F","Y",null,4]
["Y","Y","CM","3A","Bernie Rotundo >F","Y",null,4,{"$nulls":12},4]
["Y","Y","WE","3A","Kelly Spence **","Y",{"$nulls":6},4,{"$nulls":9},3]
["Y","Y","CM","3B","Bob Nitkewicz >F","Y",{"$nulls":16},3]
["Y","Y","CM","3B","Don Orlando >F","Y",{"$nulls":17},3]
["Y","Y","CR","3B","Rick Kemble","Y"]
["Y","Y","CR","4A","George Dowd >F","Y",{"$nulls":10},2,{"$nulls":5},3]
["Y","Y","LO","4A","Brian Kelley","Y",{"$nulls":10},2,{"$nulls":5},3]
["Y","Y","CN","5B","Peter Kelleher","Y",{"$nulls":14},4,null,3]
["Y","Y","CN","5B","Loren Wolfe","Y"]
["Y","Y","LO","6A","C.H. Coleman","Y"]
["Y","Y","LO","6A","Ken Sharp >F","Y",{"$nulls":4},3]
["Y","Y","SM","6A","Steve Traeger >F","Y"]
["Y","Y","SM","6A","Leon McDonald >F","Y",{"$nulls":3},2,{"$nulls":12},3,3]
["Y","Y","RT","6B","John Hubbard >F","Y",{"$nulls":14},4,null,3]
["Y","Y","SU","6B","John Rohr >F","Y"]
["Y","Y","SM","7A","Brian Rawl >F","Y",{"$nulls":15},2]
["Y","Y","CN","7B","Paul Chisari","Y",{"$nulls":16},3]
["Y","Y","CN","7B","Burt Bierman","Y"]
["Y","Y","SM","9A","Dave Silveri >F","Y",null,4,{"$nulls":3},3,{"$nulls":9},3,3]
["Y","Y","SM","9A","Ron Gosnell >F","Y",{"$nulls":5},3,4]
["Y","Y","CN","10A","Willie Charles","Y",{"$nulls":14},4]
["Y","Y","CN","10A","Sonny McKay","Y"]
["Y","Y","SU","10A","Allan Sharkey >F","Y"]
["Y","Y","SU","10B","Phil Richardson >F","Y"]
["Y","Y","SU","10B","Art Rooney >F","Y"]
["Y","Y","CC","12B","Scott Simpson","Y"]
["Y","Y","DW","13A","Chris Lee","Y",{"$nulls":6},4]
["Y","Y","LO","13A","Ron McNally **","Y"]
["Y","Y","LO","13A","Nick Greenberg","Y",3,{"$nulls":15},3]
["Y","Y","CC","14A","Pete Thompson","Y",null,4,{"$nulls":4},4,{"$nulls":7},4,null,3]
["Y","Y","WE","14A","Bernie Calcagni >F","Y",{"$nulls":5},3]
["Y","Y","CM","15A","Eddy Stubbs","Y"]
["Y","Y","CM","15A","Bubba Livingston","Y"]
["Y","Y","CN","15A","Earl Richter","Y"]
["Y","Y","CN","15A","Steve Shoff","Y",{"$nulls":6},4]
["Y","Y","PF","16A","Chris Lloyd **","Y",{"$nulls":6},4,null,3,{"$nulls":7},3]
["Y","Y","WE","16A","Doug Brainerd","Y",null,4]
["Y","Y","SM","17A","Tim Cobaugh","Y",{"$nulls":6},4,null,null,4,null,3]
["Y","Y","SM","17A","Lynn Carroll","Y",{"$nulls":15},3,3]
["Y","Y","SU","17A","Gary Hartmann","Y"]
["Y","Y","SU","17A","Gerry Purvis","Y"]
["Y","Y","WE","17B","Norm Shwarts >F","Y",null,4]
["Y","Y","WE","17B","Mark Murray","Y",{"$nulls":6},4,null,null,4,null,2,{"$nulls":4},3]
["Y","Y","LO","18A","Mike Phillips","Y",{"$nulls":9},4]
["Y","Y","PF","18B","Joe DeFilippo","Y",{"$nulls":6},4,null,3]
["Y","Y","SM","18B","Don Burckhardt","Y",{"$nulls":7},2]
["Y","Y","SM","18B","Bob Cultra","Y",{"$nulls":16},3,3]
["N",null,"CR","3B","Greg Ferrao"]
["N",null,"SU","10A","Jim Harrell **"]
["N",null,"SU","12A","Archie Miller"]
["N",null,"SU","12A","Mark Purcell"]
[null,null,"CM","1A","Dave Steffens >F"]
[null,null,"CM","1A","Jack DeStefano >F"]
[null,null,"PF","1B","Steve Bernard"]
[null,null,"PF","1B","Mike Chodnicki"]
[null,null,"DW","2A","Jack Heidenreich >F"]
[null,null,"DW","2A","Mike Eovino >F"]
[null,null,"RT","2A","Rick Cumberland >F"]
[null,null,"CM","3A","Bob Speziale >F"]
[null,null,"WE","3A","Mike Sando"]
[null,null,"CR","4A","Gene Weir >F"]
[null,null,"LO","4A","Aaron Chase"]
[null,null,"CC","5A","Chip Harriman"]
[null,null,"CC","5A","Jay Arnold >F"]
[null,null,"CM","5A","Doug George"]
[null,null,"DW","5B","Scott Gowdy"]
[null,null,"DW","5B","Jim Devall"]
[null,null,"RT","6B","David Sturgess"]
[null,null,"SU","6B","Bob Sideikas >F"]
[null,null,"LO","7A","Ross Bailey >F"]
[null,null,"LO","7A","Kevin Welter >F"]
[null,null,"SM","7A","Robert Pickard >F"]
[null,null,"RT","7B","Bill Stein"]
[null,null,"RT","7B","Joe Stein"]
[null,null,"CC","8A","John Gaag **"]
[null,null,"CC","8A","Mark Mattison"]
[null,null,"DW","8A","Jack Fava"]
[null,null,"DW","8A","Albert Dainton"]
[null,null,"PF","9A","David George >F"]
[null,null,"PF","9A","Jerry Walton >F"]
[null,null,"RT","10B","Rick Corcoran **"]
[null,null,"RT","10B","Greg Martin"]
[null,null,"CC","11A","Jim Petros"]
[null,null,"CC","11A","Mike Ankenbruck"]
[null,null,"CM","11A","Al Stiles >F"]
[null,null,"PF","12A","Jerry Cobb >F"]
[null,null,"PF","12A","Russ Deuell **"]
[null,null,"CC","12B","John Stark"]
[null,null,"CR","12B","David Kessen"]
[null,null,"CR","12B","Tim McManus"]
[null,null,"DW","13A","Ron Thorne"]
[null,null,"CC","14A","Markus Peter"]
[null,null,"WE","14A","Mike Scioli **"]
[null,null,"CR","15B","Bill Barrett"]
[null,null,"CR","15B","Mick Boone >F"]
[null,null,"RT","15B","Steve Fischer"]
[null,null,"RT","15B","Timmy Rogers"]
[null,null,"PF","16A","Ray Boutin"]
[null,null,"WE","16A","David Hotchkiss"]
[null,null,"DW","17B","Tom Montesi"]
[null,null,"DW","17B","Ray Bradshaw"]
[null,null,"CR","18A","Fred Robinson"]
[null,null,"CR","18A","Jim Thompson >F"]
[null,null,"LO","18A","Michael Creighton"]
[null,null,"PF","18B","David Williams2 >F"]

{"sheet":"SAMPLE SPLIT TEE","index":3,"n_rows":115,"n_cols":24,"rows_kept":115,"merged":[[0,0,0,4],[0,5,2,11],[1,0,1,4],[2,0,2,4],[3,0,3,4]]}
["This is the structure and type data you'll get from Google Sheets File.  USE this data to practice Skins tab work for Split Tee (Crowfield Only).",{"$nulls":4},"USE THIS DATA IF YOU CLEAR ALL ON THE SKINS TAB AS YOU CANNOT UNDO A MACRO THAT CLEARS DATA."]
["Cut and Paste \"All\" Values to the Skins worksheet/tab"]
["COPY/PASTE AREA W/Light Orange Background (no scores)"]
["ALWAYS PASTE \"VALUES\" ONLY"]
["Skins?","Paid?","Club","Start Tee","Name"]
["Y","Y","CC","#1 - 8:30","Bill Boan >F","Y",{"$nulls":8},3]
["Y","Y","CR","#1 - 8:30","Hugh Belser","Y"]
["Y","Y","CR","#1 - 8:30","Tim McManus","Y"]
["Y","Y","CC","#1 - 8:39","John Carlile","Y",{"$nulls":8},3]
["Y","Y","PF","#10 - 8:39","Chris Lloyd","Y",null,4]
["Y","Y","PF","#10 - 8:39","Scotty Weathers **","Y",{"$nulls":17},4]
["Y","Y","WE","#10 - 8:39","Kelly Spence","Y",{"$nulls":6},4]
["Y","Y","CR","#1 - 8:48","George Dowd >F","Y",{"$nulls":6},4]
["Y","Y","CC","#10 - 8:48","Scott Simpson","Y"]
["Y","Y","CC","#10 - 8:48","Chip Harriman","Y"]
["Y","Y","CR","#1 - 8:57","David Kessen","Y"]
["Y","Y","WE","#10 - 8:57","Stan Petrohovich","Y"]
["Y","Y","SU","#10 - 9:06","Kyle Boczkowski","Y"]
["Y","Y","SU","#10 - 9:06","Barry Connor >F","Y"]
["Y","Y","LO","#1 - 9:15","Al Sims","Y"]
["Y","Y","LO","#1 - 9:15","George Vaughn","Y"]
["Y","Y","CR","#10 - 9:15","Gene Weir >F","Y",{"$nulls":3},2,{"$nulls":3},2]
["Y","Y","SM","#10 - 9:15","Don Burckhardt","Y",null,null,3,{"$nulls":9},2]
["Y","Y","SM","#10 - 9:15","Bob Cultra","Y"]
["Y","Y","LO","#1 - 9:24","Herman Johnson >F","Y"]
["Y","Y","SM","#1 - 9:24","Brian Rawl >F","Y",{"$nulls":8},3,{"$nulls":7},3]
["Y","Y","LO","#10 - 9:24","Bob Richards","Y"]
["Y","Y","LO","#10 - 9:24","John Schneidmuller","Y",{"$nulls":14},3]
["Y","Y","SM","#10 - 9:24","Lynn Carroll","Y"]
["Y","Y","SM","#10 - 9:24","Chuck Morris","Y"]
["Y","Y","SM","#1 - 9:33","Leon McDonald >F","Y"]
["Y","Y","SM","#1 - 9:33","Steve Traeger >F","Y"]
["Y","Y","SU","#1 - 9:33","Phil Richardson >F","Y"]
["Y","Y","SU","#1 - 9:33","Art Rooney >F","Y",3,{"$nulls":5},4,{"$nulls":5},2]
["Y","Y","LO","#10 - 9:33","Mike Phillips","Y",{"$nulls":7},2,{"$nulls":3},3]
["Y","Y","LO","#10 - 9:33","Ron McNally","Y",{"$nulls":4},3]
["Y","Y","SU","#10 - 9:33","Mike Anderson","Y"]
["Y","Y","SU","#10 - 9:33","Archie Miller","Y"]
["Y","Y","CM","#1 - 9:42","Alex Hartsell >F **","Y",{"$nulls":14},3]
["Y","Y","SU","#1 - 9:42","Alan Sharkey >F","Y"]
["Y","Y","SU","#1 - 9:42","Randy Henderson >F","Y",null,4]
["Y","Y","SM","#10 - 9:42","Dave Silveri >F","Y"]
["Y","Y","SM","#10 - 9:42","Marty Carsner >F **","Y"]
["Y","Y","SU","#10 - 9:42","Bob Hampe >F","Y"]
["Y","Y","RT","#1 - 9:51","Jim Delaney >F","Y"]
["Y","Y","CN","#10 - 9:51","Jack Gedney **","Y",{"$nulls":4},3]
["Y","Y","CN","#10 - 9:51","Peter Kelleher","Y",{"$nulls":6},4]
["Y","Y","CN","#1 - 10:00","Loren Wolfe >F","Y"]
["Y","Y","CN","#1 - 10:00","Paul Chisari","Y"]
["Y","Y","CM","#10 - 10:00","Bob Nitkewicz >F","Y",{"$nulls":10},4]
["Y","Y","CN","#1 - 10:09","Earl Richter","Y",{"$nulls":6},4,{"$nulls":3},4,null,2,{"$nulls":3},3]
["Y","Y","CN","#1 - 10:09","Frank Peters","Y"]
["Y","Y","CN","#10 - 10:09","Jim Zadora","Y"]
["Y","Y","CN","#10 - 10:09","Gunnar Jansson","Y",{"$nulls":13},3,{"$nulls":3},4]
["Y","Y","DW","#10 - 10:09","Chris Lee","Y",{"$nulls":8},3]
["Y","Y","RT","#1 - 10:18","Jim Joyce","Y",{"$nulls":7},2]
["Y","Y","CM","#10 - 10:18","Bernie Rotundo >F","Y"]
["Y","Y","CN","#10 - 10:18","Willie Charles","Y"]
["Y",null,"CN","#10 - 10:18","Sonny McKay","Y",{"$nulls":14},3]
["Y",null,"CR","#1 - 10:27","Fred Robinson","Y"]
["Y","Y","CR","#1 - 10:27","Rick Kemble",{"$nulls":7},4,{"$nulls":3},4,{"$nulls":5},3]
["Y","Y","RT","#10 - 10:27","John Hubbard >F",null,null,4,{"$nulls":8},4,{"$nulls":6},4]
[null,null,"CC","#1 - 8:30","Jay Arnold >F"]
[null,null,"PF","#10 - 8:30","David George >F"]
[null,null,"PF","#10 - 8:30","Jerry Cobb >F"]
[null,null,"WE","#10 - 8:30","Jim Magnotta"]
[null,null,"WE","#10 - 8:30","Paul Cornell"]
[null,null,"CC","#1 - 8:39","Tom Gormley"]
[null,null,"PF","#1 - 8:39","Russ Deuell"]
[null,null,"PF","#1 - 8:39","Mike Chodnicki"]
[null,null,"WE","#10 - 8:39","Bob Lukas"]
[null,null,"CR","#1 - 8:48","Mick Boone >F"]
[null,null,"PF","#1 - 8:48","Steve Bernard"]
[null,null,"PF","#1 - 8:48","Ray Boutin"]
[null,null,"WE","#10 - 8:48","Norm Shwarts >F"]
[null,null,"WE","#10 - 8:48","Rich Mudrick >F"]
[null,null,"CC","#1 - 8:57","Mike Cleveringa"]
[null,null,"CC","#1 - 8:57","Mark Mattison"]
[null,null,"CR","#1 - 8:57","Bill Barrett"]
[null,null,"PF","#10 - 8:57","Jim Lusby >F"]
[null,null,"PF","#10 - 8:57","David Williams2 >F"]
[null,null,"WE","#10 - 8:57","Pete Germani"]
[null,null,"LO","#1 - 9:06","Mike Bates"]
[null,null,"LO","#1 - 9:06","Don Stephan"]
[null,null,"WE","#1 - 9:06","Peter Jones"]
[null,null,"WE","#1 - 9:06","David Hotchkiss"]
[null,null,"CC","#10 - 9:06","Jim Petros"]
[null,null,"CC","#10 - 9:06","Dennis Rosenbeck >F"]
[null,null,"CR","#1 - 9:15","Jim Thompson >F"]
[null,null,"LO","#1 - 9:24","Kevin Welter >F"]
[null,null,"SM","#1 - 9:24","George Burnham >F"]
[null,null,"CM","#1 - 9:42","James Bailey >F"]
[null,null,"SU","#10 - 9:42","Bob Sideikas >F"]
[null,null,"DW","#1 - 9:51","Jack Heidenreich >F"]
[null,null,"DW","#1 - 9:51","Mike Eovino >F"]
[null,null,"RT","#1 - 9:51","Rick Cumberland >F"]
[null,null,"DW","#10 - 9:51","Jack Fava"]
[null,null,"DW","#10 - 9:51","Ray Bradshaw"]
[null,null,"CM","#1 - 10:00","Ted Kornya >F"]
[null,null,"CM","#1 - 10:00","Chuck Zirkle >F"]
[null,null,"CM","#10 - 10:00","Al Stiles >F"]
[null,null,"RT","#10 - 10:00","Steve Fischer"]
[null,null,"RT","#10 - 10:00","Greg Martin"]
[null,null,"DW","#1 - 10:09","Scott Gowdy"]
[null,null,"DW","#1 - 10:09","Jim Devall"]
[null,null,"DW","#10 - 10:09","Kevin Cooper"]
[null,null,"CM","#1 - 10:18","Jack DeStefano >F"]
[null,null,"CM","#1 - 10:18","Dave Steffens >F"]
[null,null,"RT","#1 - 10:18","Rick Corcoran"]
[null,null,"CM","#10 - 10:18","Dick Greene >F **"]
[null,null,"RT","#1 - 10:27","John Waters"]
[null,null,"RT","#1 - 10:27","Timmy Rogers"]
[null,null,"DW","#10 - 10:27","Ron Thorne"]
[null,null,"DW","#10 - 10:27","Bob Malaussena"]
[null,null,"RT","#10 - 10:27","Roger Schroeder >F"]